{"text_format":"1","workbook":"xlsx","n_sheets":6,"sheets":["ANALİZ","Veri1","Veri2","Veri3","Most","NW"],"not_rendered":{"charts":0,"images":0,"macros":0,"external_links":0,"defined_names":1,"comments":0,"pivot_tables":0},"unopened":[],"bounds":{"document_bytes":16777216,"sheet_cells":100000,"rows_first":2000,"rows_last":500,"rows_between":2000,"halvings":0,"cell_chars":16384,"cell_head_chars":4096},"cells_cut":0,"cells_raw":0,"read":"whole","date_system":"1900"}

{"sheet":"ANALİZ","index":0,"n_rows":26,"n_cols":26,"rows_kept":26,"cut":false,"hidden":false,"merged":[[20,1,20,15],[1,18,1,20],[1,21,1,23],[1,24,2,25],[2,18,2,20],[2,21,2,23],[1,17,3,17],[1,1,1,15],[7,1,7,15],[13,1,13,15],[14,1,14,15],[10,21,11,22],[12,21,14,21],[12,22,14,22]]}
[]
[null,"İLK YARI SONUCU",null,null,null,null,null,null,null,null,null,null,null,null,null,null,null,"ANALİZ SONUÇLARI",{"$f":"Veri2!A21","v":"Lambton Jaffas"},null,null,{"$f":"Veri2!A46","v":"Edgeworth Eagles"},null,null,"BTT/KG VE HT/FT-İY/MS"]
[null,{"$f":"Veri2!A21","v":"Lambton Jaffas"},"O","G","B","M","A","Y","G","B","M","A","Y","AV","TOPL. PU","ORT. PU",null,null,"İLK YARI",null,null,"MAÇ SONU"]
[null,"GENEL",{"$f":"Veri3!N4","v":7},{"$f":"Veri3!O4","v":3},{"$f":"Veri3!P4","v":3},{"$f":"Veri3!Q4","v":1},{"$f":"Veri3!R4","v":5},{"$f":"Veri3!S4","v":3},{"$f":"Veri3!T4","v":0.42857142857142855},{"$f":"Veri3!U4","v":0.42857142857142855},{"$f":"Veri3!V4","v":0.14285714285714285},{"$f":"Veri3!W4","v":0.7142857142857143},{"$f":"Veri3!X4","v":0.42857142857142855},{"$f":"Veri3!Y4","v":2},{"$f":"Veri3!Z4","v":12},{"$f":"Veri3!AA4","v":1.7142857142857142},null,null,"1-X-2","SKOR","ALT-ÜST","1-X-2","SKOR","ALT-ÜST","KG VAR","SONUÇ"]
[null,"İÇERDE",{"$f":"Veri3!N5","v":3},{"$f":"Veri3!O5","v":1},{"$f":"Veri3!P5","v":2},{"$f":"Veri3!Q5","v":0},{"$f":"Veri3!R5","v":2},{"$f":"Veri3!S5","v":1},{"$f":"Veri3!T5","v":0.33333333333333331},{"$f":"Veri3!U5","v":0.66666666666666663},{"$f":"Veri3!V5","v":0},{"$f":"Veri3!W5","v":0.66666666666666663},{"$f":"Veri3!X5","v":0.33333333333333331},{"$f":"Veri3!Y5","v":1},{"$f":"Veri3!Z5","v":5},{"$f":"Veri3!AA5","v":1.6666666666666667},null," GENEL ANALİZ - NOWGOAL5",{"$f":"Veri3!AD5","v":"X"},{"$f":"Veri3!AE5","v":"1 - 1"},{"$f":"Veri3!AF5","v":"1.5 GOL ÜST"},{"$f":"Veri3!AG5","v":"1"},{"$f":"Veri3!AH5","v":"2 - 1"},{"$f":"Veri3!AI5","v":"2.5 GOL ÜST"},{"$f":"Veri3!AJ5","v":"VAR"},{"$f":"Veri3!AK5","v":"X / 1"}]
[null,"DIŞARDA",{"$f":"Veri3!N6","v":4},{"$f":"Veri3!O6","v":2},{"$f":"Veri3!P6","v":1},{"$f":"Veri3!Q6","v":1},{"$f":"Veri3!R6","v":3},{"$f":"Veri3!S6","v":2},{"$f":"Veri3!T6","v":0.5},{"$f":"Veri3!U6","v":0.25},{"$f":"Veri3!V6","v":0.25},{"$f":"Veri3!W6","v":0.75},{"$f":"Veri3!X6","v":0.5},{"$f":"Veri3!Y6","v":1},{"$f":"Veri3!Z6","v":7},{"$f":"Veri3!AA6","v":1.75},null," İÇ-DIŞ ANALİZ - NOWGOAL5",{"$f":"Veri3!AD6","v":"1"},{"$f":"Veri3!AE6","v":"1 - 0"},{"$f":"Veri3!AF6","v":"1.5 GOL ÜST"},{"$f":"Veri3!AG6","v":"1"},{"$f":"Veri3!AH6","v":"2 - 1"},{"$f":"Veri3!AI6","v":"2.5 GOL ÜST"},{"$f":"Veri3!AJ6","v":"VAR"},{"$f":"Veri3!AK6","v":"1 / 1"}]
[null,"SON 6 MAÇ",{"$f":"Veri3!N7","v":6},{"$f":"Veri3!O7","v":3},{"$f":"Veri3!P7","v":2},{"$f":"Veri3!Q7","v":1},{"$f":"Veri3!R7","v":5},{"$f":"Veri3!S7","v":3},{"$f":"Veri3!T7","v":0.5},{"$f":"Veri3!U7","v":0.33333333333333331},{"$f":"Veri3!V7","v":0.16666666666666666},{"$f":"Veri3!W7","v":0.83333333333333337},{"$f":"Veri3!X7","v":0.5},{"$f":"Veri3!Y7","v":2},{"$f":"Veri3!Z7","v":11},{"$f":"Veri3!AA7","v":1.8333333333333333},null," SON 6 ANALİZİ - NOWGOAL5",{"$f":"Veri3!AD7","v":"X"},{"$f":"Veri3!AE7","v":"1 - 1"},{"$f":"Veri3!AF7","v":"1.5 GOL ÜST"},{"$f":"Veri3!AG7","v":"1"},{"$f":"Veri3!AH7","v":"2 - 1"},{"$f":"Veri3!AI7","v":"2.5 GOL ÜST"},{"$f":"Veri3!AJ7","v":"VAR"},{"$f":"Veri3!AK7","v":"X / 1"}]
[null,null,null,null,null,null,null,null,null,null,null,null,null,null,null,null,null," SON 15 ANALİZİ - MOST",{"$f":"Most!H9","v":"X"},{"$f":"Most!G9","v":"1 - 1"},{"$f":"Most!G17","v":"1.5 GOL ÜST"},{"$f":"Most!N9","v":" 1"},{"$f":"Most!O9","v":"2 - 1"},{"$f":"Most!L17","v":"2.5 GOL ÜST"},{"$f":"Most!J6","v":"VAR"},{"$f":"Most!J8","v":"X / 1"}]
[null,{"$f":"Veri2!A46","v":"Edgeworth Eagles"},"O","G","B","M","A","Y","G","B","M","A","Y","AV","TOPL. PU","ORT. PU"]
[null,"GENEL",{"$f":"Veri3!N10","v":9},{"$f":"Veri3!O10","v":3},{"$f":"Veri3!P10","v":2},{"$f":"Veri3!Q10","v":4},{"$f":"Veri3!R10","v":8},{"$f":"Veri3!S10","v":6},{"$f":"Veri3!T10","v":0.33333333333333331},{"$f":"Veri3!U10","v":0.22222222222222221},{"$f":"Veri3!V10","v":0.44444444444444442},{"$f":"Veri3!W10","v":0.88888888888888884},{"$f":"Veri3!X10","v":0.66666666666666663},{"$f":"Veri3!Y10","v":2},{"$f":"Veri3!Z10","v":11},{"$f":"Veri3!AA10","v":1.2222222222222223}]
[null,"İÇERDE",{"$f":"Veri3!N11","v":4},{"$f":"Veri3!O11","v":2},{"$f":"Veri3!P11","v":1},{"$f":"Veri3!Q11","v":1},{"$f":"Veri3!R11","v":4},{"$f":"Veri3!S11","v":1},{"$f":"Veri3!T11","v":0.5},{"$f":"Veri3!U11","v":0.25},{"$f":"Veri3!V11","v":0.25},{"$f":"Veri3!W11","v":1},{"$f":"Veri3!X11","v":0.25},{"$f":"Veri3!Y11","v":3},{"$f":"Veri3!Z11","v":7},{"$f":"Veri3!AA11","v":1.75},null,null,null,null,{"$f":"Veri2!AS114","v":-2},{"$f":"Veri2!AT114","v":"MOST'A GÖRE RİSKLİ"}]
[null,"DIŞARDA",{"$f":"Veri3!N12","v":5},{"$f":"Veri3!O12","v":1},{"$f":"Veri3!P12","v":1},{"$f":"Veri3!Q12","v":3},{"$f":"Veri3!R12","v":4},{"$f":"Veri3!S12","v":5},{"$f":"Veri3!T12","v":0.2},{"$f":"Veri3!U12","v":0.2},{"$f":"Veri3!V12","v":0.6},{"$f":"Veri3!W12","v":0.8},{"$f":"Veri3!X12","v":1},{"$f":"Veri3!Y12","v":-1},{"$f":"Veri3!Z12","v":4},{"$f":"Veri3!AA12","v":0.8}]
[null,"SON 6 MAÇ",{"$f":"Veri3!N13","v":6},{"$f":"Veri3!O13","v":3},{"$f":"Veri3!P13","v":0},{"$f":"Veri3!Q13","v":3},{"$f":"Veri3!R13","v":8},{"$f":"Veri3!S13","v":5},{"$f":"Veri3!T13","v":0.5},{"$f":"Veri3!U13","v":0},{"$f":"Veri3!V13","v":0.5},{"$f":"Veri3!W13","v":1.3333333333333333},{"$f":"Veri3!X13","v":0.83333333333333337},{"$f":"Veri3!Y13","v":3},{"$f":"Veri3!Z13","v":9},{"$f":"Veri3!AA13","v":1.5},null,null,null,null,null,{"$f":"Most!G20","v":"İY1"},{"$f":"Most!L20","v":"MS1"}]
[]
[null,"MAÇ SONUCU"]
[null,{"$f":"B3","v":"Lambton Jaffas"},"O","G","B","M","A","Y","G","B","M","A","Y","AV","TOPL. PU","ORT. PU"]
[null,"GENEL",{"$f":"Veri3!N17","v":7},{"$f":"Veri3!O17","v":4},{"$f":"Veri3!P17","v":2},{"$f":"Veri3!Q17","v":1},{"$f":"Veri3!R17","v":10},{"$f":"Veri3!S17","v":7},{"$f":"Veri3!T17","v":0.5714285714285714},{"$f":"Veri3!U17","v":0.2857142857142857},{"$f":"Veri3!V17","v":0.14285714285714285},{"$f":"Veri3!W17","v":1.4285714285714286},{"$f":"Veri3!X17","v":1},{"$f":"Veri3!Y17","v":3},{"$f":"Veri3!Z17","v":14},{"$f":"Veri3!AA17","v":2}]
[null,"İÇERDE",{"$f":"Veri3!N18","v":3},{"$f":"Veri3!O18","v":1},{"$f":"Veri3!P18","v":2},{"$f":"Veri3!Q18","v":0},{"$f":"Veri3!R18","v":4},{"$f":"Veri3!S18","v":3},{"$f":"Veri3!T18","v":0.33333333333333331},{"$f":"Veri3!U18","v":0.66666666666666663},{"$f":"Veri3!V18","v":0},{"$f":"Veri3!W18","v":1.3333333333333333},{"$f":"Veri3!X18","v":1},{"$f":"Veri3!Y18","v":1},{"$f":"Veri3!Z18","v":5},{"$f":"Veri3!AA18","v":1.6666666666666667}]
[null,"DIŞARDA",{"$f":"Veri3!N19","v":4},{"$f":"Veri3!O19","v":3},{"$f":"Veri3!P19","v":0},{"$f":"Veri3!Q19","v":1},{"$f":"Veri3!R19","v":6},{"$f":"Veri3!S19","v":4},{"$f":"Veri3!T19","v":0.75},{"$f":"Veri3!U19","v":0},{"$f":"Veri3!V19","v":0.25},{"$f":"Veri3!W19","v":1.5},{"$f":"Veri3!X19","v":1},{"$f":"Veri3!Y19","v":2},{"$f":"Veri3!Z19","v":9},{"$f":"Veri3!AA19","v":2.25}]
[null,"SON 6 MAÇ",{"$f":"Veri3!N20","v":6},{"$f":"Veri3!O20","v":3},{"$f":"Veri3!P20","v":2},{"$f":"Veri3!Q20","v":1},{"$f":"Veri3!R20","v":8},{"$f":"Veri3!S20","v":6},{"$f":"Veri3!T20","v":0.5},{"$f":"Veri3!U20","v":0.33333333333333331},{"$f":"Veri3!V20","v":0.16666666666666666},{"$f":"Veri3!W20","v":1.3333333333333333},{"$f":"Veri3!X20","v":1},{"$f":"Veri3!Y20","v":2},{"$f":"Veri3!Z20","v":11},{"$f":"Veri3!AA20","v":1.8333333333333333}]
[]
[null,{"$f":"B9","v":"Edgeworth Eagles"},"O","G","B","M","A","Y","G","B","M","A","Y","AV","TOPL. PU","ORT. PU"]
[null,"GENEL",{"$f":"Veri3!N23","v":9},{"$f":"Veri3!O23","v":4},{"$f":"Veri3!P23","v":1},{"$f":"Veri3!Q23","v":4},{"$f":"Veri3!R23","v":14},{"$f":"Veri3!S23","v":16},{"$f":"Veri3!T23","v":0.44444444444444442},{"$f":"Veri3!U23","v":0.1111111111111111},{"$f":"Veri3!V23","v":0.44444444444444442},{"$f":"Veri3!W23","v":1.5555555555555556},{"$f":"Veri3!X23","v":1.7777777777777777},{"$f":"Veri3!Y23","v":-2},{"$f":"Veri3!Z23","v":13},{"$f":"Veri3!AA23","v":1.4444444444444444}]
[null,"İÇERDE",{"$f":"Veri3!N24","v":4},{"$f":"Veri3!O24","v":2},{"$f":"Veri3!P24","v":1},{"$f":"Veri3!Q24","v":1},{"$f":"Veri3!R24","v":6},{"$f":"Veri3!S24","v":4},{"$f":"Veri3!T24","v":0.5},{"$f":"Veri3!U24","v":0.25},{"$f":"Veri3!V24","v":0.25},{"$f":"Veri3!W24","v":1.5},{"$f":"Veri3!X24","v":1},{"$f":"Veri3!Y24","v":2},{"$f":"Veri3!Z24","v":7},{"$f":"Veri3!AA24","v":1.75}]
[null,"DIŞARDA",{"$f":"Veri3!N25","v":5},{"$f":"Veri3!O25","v":2},{"$f":"Veri3!P25","v":0},{"$f":"Veri3!Q25","v":3},{"$f":"Veri3!R25","v":8},{"$f":"Veri3!S25","v":12},{"$f":"Veri3!T25","v":0.4},{"$f":"Veri3!U25","v":0},{"$f":"Veri3!V25","v":0.6},{"$f":"Veri3!W25","v":1.6},{"$f":"Veri3!X25","v":2.4},{"$f":"Veri3!Y25","v":-4},{"$f":"Veri3!Z25","v":6},{"$f":"Veri3!AA25","v":1.2}]
[null,"SON 6 MAÇ",{"$f":"Veri3!N26","v":6},{"$f":"Veri3!O26","v":3},{"$f":"Veri3!P26","v":1},{"$f":"Veri3!Q26","v":2},{"$f":"Veri3!R26","v":12},{"$f":"Veri3!S26","v":11},{"$f":"Veri3!T26","v":0.5},{"$f":"Veri3!U26","v":0.16666666666666666},{"$f":"Veri3!V26","v":0.33333333333333331},{"$f":"Veri3!W26","v":2},{"$f":"Veri3!X26","v":1.8333333333333333},{"$f":"Veri3!Y26","v":1},{"$f":"Veri3!Z26","v":10},{"$f":"Veri3!AA26","v":1.6666666666666667}]

{"sheet":"Veri1","index":1,"n_rows":972,"n_cols":35,"rows_kept":972,"cut":false,"hidden":false,"merged":[[0,20,1,34]]}
[null,null,null,null,null,null,null,null,null,null,null,null,null,null,null,null,null,null,null,null,"FORMÜLLÜ HÜCRE SİLMEYİNİZ !!!"]
[]
[]
["Skip Navigation Links"]
[]
["Betistuta"]
["Futbol"]
["Basketbol"]
["Voleybol"]
["Hentbol"]
["BuzHokeyi"]
["Beyzbol"]
["Tenis"]
["BOYZ(F)"]
["BOYZ(B)"]
["Orandelli"]
["Gol Oldu mu ?"]
["Iletisim"]
["<","June 2022",">"]
["Sun","Mon","Tue","Wed","Thu","Fri","Sat"]
[29,30,31,"1",2,"3",4]
[5,6,7,"8",9,"10",11]
[12,13,14,"15",16,"17",18]
[19,20,21,"22",23,"24",25]
[26,27,28,"29",30,"1",2]
[3,4,5,"6",7,"8",9]
[null,"Tüm LiglerSadece İddaa MaçlarıABD-MLSABD-USLABD-USL Lig 1AFC U23 Sampiyonasi-Çeyrek FinalArjantin-Premier Lig 2. AsamaArjantin-Prim B Metro ClausuraArjantin-Torneo Federal A GüneyArjantin-Torneo Federal A KuzeyArjantin-Ulusal Primera LigAvrupa U21 Sampiyonasi-Eleme Turu Grup 8Avustralya-Ulusal Premier Lig Kuzey YGGAvustralya-Ulusal Premier Lig Yeni Güney GallerBelarus-1.LigBolivya-Premier Lig Apertura FinalBrezilya-AmapaenseBrezilya-Serie ABrezilya-Serie BBrezilya-Serie CBrezilya-Serie D Grup 1Brezilya-Serie D Grup 2Brezilya-Serie D Grup 3Brezilya-Serie D Grup 4Brezilya-Serie D Grup 5Brezilya-Serie D Grup 7Brezilya-Serie D Grup 8Çek Cumhuriyeti-3.Lig CFL AÇek Cumhuriyeti-3.Lig CFL BÇin Halk Cumhuriyeti-1.LigÇin Halk Cumhuriyeti-Süper LigCONCACAF Uluslar Ligi-Lig A Grup ACONCACAF Uluslar Ligi-Lig B Grup ACONCACAF Uluslar Ligi-Lig B Grup BCONCACAF Uluslar Ligi-Lig C Grup AFinlandiya-Kakkonen Grup AFinlandiya-Kakkonen Grup BFinlandiya-Kakkonen Grup CFinlandiya-YkkönenGana-Premier LigGüney Kore-K Lig 2Güney Kore-K3 LigiHazirlik-ÜlkelerIsveç-1.Lig KuzeyIsveç-2.Lig Norra GötalandIsveç-2.Lig Norra SvealandIsveç-2.Lig Södra GötalandIsveç-2.Lig Södra SvealandIsveç-2.Lig Vastra GötalandItalya-Serie C Yükselme Play Off FinalJaponya-Futbol LigiJaponya-J2 LigJaponya-J3 LigKanada-Premier LigKenya-Süper LigKolombiya-Primera A Apertura Quadrangular Grup AKolombiya-Primera A Apertura Quadrangular Grup BLetonya-Kupa 2.TurLitvanya-1.LigNijerya-NPFLNorveç-2.Lig Grup 1Norveç-2.Lig Grup 2Norveç-3.Lig Grup 1Norveç-3.Lig Grup 2Norveç-3.Lig Grup 5Norveç-3.Lig Grup 6Paraguay-Intermedia LigParaguay-Profesyonel Lig AperturaPeru-2.Lig AperturaUEFA Uluslar Ligi-A Ligi Grup 2UEFA Uluslar Ligi-B Ligi Grup 4UEFA Uluslar Ligi-C Ligi Grup 2UEFA Uluslar Ligi-C Ligi Grup 4UEFA Uluslar Ligi-D Ligi Grup 2Venezuela-Premier Lig"]
[]
["Maç Sayısı: 113, Oynanan : 0, Yön:0, Skor : 0, Başarı : %NaN"]
["Kod","Saat","EvSahibi","MS","Deplasman","IY","Lig","MSBS","MS1","MS0","MS2","MSTG1","MSTG2","IYBS","IY1","IY0","IY2","IYTG1","IYTG2",null,"- İşaret Bul","MSBS EV","MSBS DEP","MSBS TOP. GOL","MS BAHİS OYNA","- İşaret Bul","IYBS EV","IYBS DEP","IYBS TOP. GOL","İY BAHİS OYNA","2.5 GOL ÜST BANKO","MAK","MS1","MS0","MS2"]
[null,null,null,null,null,null,null,null,null,null,null,null,null,null,null,null,null,null,null,null,null,null,null,null,null,null,null,null,null,null,null,0,0,0,0]
[763767,"00:00:00","CA Sarmiento","v","Argentinos Juni"," ","Arjantin","1 - 2","23.8","33.4","42.7",36,64,"0-1","23.9","33.4","42.7",36,64,null,{"$f":"IF(H32=\"\",\" \",SEARCH(\"-\",H32))","v":3},{"$f":"IF(H32=\"\",\" \",LEFT(H32,U32-1))","v":"1 "},{"$f":"IF(H32=\"\",\" \",MID(H32,U32+1,4))","v":" 2"},{"$f":"IF(H32=\"\",\" \",V32+W32)","v":3},{"$f":"IF(H32=\"\",\" \",IF(X32>=4,\"OK\",\"NOT OK\"))","v":"NOT OK"},{"$f":"IF(N32=\"\",\" \",SEARCH(\"-\",N32))","v":2},{"$f":"IF(N32=\"\",\" \",LEFT(N32,Z32-1))","v":"0"},{"$f":"IF(N32=\"\",\" \",MID(N32,Z32+1,4))","v":"1"},{"$f":"IF(N32=\"\",\" \",AA32+AB32)","v":1},{"$f":"IF(N32=\"\",\" \",IF(AC32>=2,\"OK\",\"NOT OK\"))","v":"NOT OK"},{"$f":"IF(H32=\"\",\" \",IF(AND(Y32=\"OK\",AD32=\"OK\"),\"OYNA\",IF(Y32=AD32,\"OYNAMA\",IF(Y32=AD32,\"OYNA\",\"OYNAMA\"))))","v":"OYNAMA"},{"$f":"IF(H32=\"\",\"0\",IF(OR(AG32>=65,AH32>=55,AI32>=65),MAX(AG32:AI32),0))*1","v":0},{"$f":"IF(H32=\"\",\"0\",SUBSTITUTE(I32,\".\",\",\"))*1","v":23.8},{"$f":"IF(H32=\"\",\"0\",SUBSTITUTE(J32,\".\",\",\"))*1","v":33.4},{"$f":"IF(H32=\"\",\"0\",SUBSTITUTE(K32,\".\",\",\"))*1","v":42.7}]
[754688,"00:00:00","Nautico RR","v","Sao Raimundo AM"," ","Brezilya","1 - 3","19.1","27.7","53.1",27,73,"0-1","19.3","27.1","53.6",27,73,null,{"$f":"IF(H33=\"\",\" \",SEARCH(\"-\",H33))","v":3},{"$f":"IF(H33=\"\",\" \",LEFT(H33,U33-1))","v":"1 "},{"$f":"IF(H33=\"\",\" \",MID(H33,U33+1,4))","v":" 3"},{"$f":"IF(H33=\"\",\" \",V33+W33)","v":4},{"$f":"IF(H33=\"\",\" \",IF(X33>=4,\"OK\",\"NOT OK\"))","v":"OK"},{"$f":"IF(N33=\"\",\" \",SEARCH(\"-\",N33))","v":2},{"$f":"IF(N33=\"\",\" \",LEFT(N33,Z33-1))","v":"0"},{"$f":"IF(N33=\"\",\" \",MID(N33,Z33+1,4))","v":"1"},{"$f":"IF(N33=\"\",\" \",AA33+AB33)","v":1},{"$f":"IF(N33=\"\",\" \",IF(AC33>=2,\"OK\",\"NOT OK\"))","v":"NOT OK"},{"$f":"IF(H33=\"\",\" \",IF(AND(Y33=\"OK\",AD33=\"OK\"),\"OYNA\",IF(Y33=AD33,\"OYNAMA\",IF(Y33=AD33,\"OYNA\",\"OYNAMA\"))))","v":"OYNAMA"},0,{"$f":"IF(H33=\"\",\"0\",SUBSTITUTE(I33,\".\",\",\"))*1","v":19.100000000000001},{"$f":"IF(H33=\"\",\"0\",SUBSTITUTE(J33,\".\",\",\"))*1","v":27.7},{"$f":"IF(H33=\"\",\"0\",SUBSTITUTE(K33,\".\",\",\"))*1","v":53.1}]
[747403,"00:00:00","Deportivo La Gu","v","Portuguesa FC"," ","Venezuela","0 - 2","17.4","31.3","51.3",25,75,"0-1","18.7","26.2","55",25,75,null,3,"0 "," 2",2,"NOT OK",2,"0","1",1,"NOT OK","OYNAMA",0,17.399999999999999,31.3,51.3]
[747184,"00:30:00","Operario PR","v","Bahia"," ","Brezilya","0 - 2","20.1","32.1","47.9",30,70,"0-1","21.2","29.7","49.2",30,70,null,3,"0 "," 2",2,"NOT OK",2,"0","1",1,"NOT OK","OYNAMA",0,20.100000000000001,32.1,47.9]
[747198,"00:30:00","Tocantinopolis","v","4 De Julho"," ","Brezilya","2 - 0","56.1","29.3","14.5",79,21,"1-0","52.4","27.8","19.8",73,27,null,3,"2 "," 0",2,"NOT OK",2,"1","0",1,"NOT OK","OYNAMA",0,56.1,29.3,14.5]
[747398,"01:00:00","Monterey Bay","v","San Antonio"," ","ABD","1 - 2","20.9","32.1","47",31,69,"0-1","23.7","33.2","43.1",36,64,null,3,"1 "," 2",3,"NOT OK",2,"0","1",1,"NOT OK","OYNAMA",0,20.9,32.1,47]
[747868,"01:00:00","Cuiaba","v","Bragantino"," ","Brezilya","1 - 0","51","32.5","16.6",75,25,"1-0","53.4","27.2","19.4",73,27,null,3,"1 "," 0",1,"NOT OK",2,"1","0",1,"NOT OK","OYNAMA",0,51,32.5,16.600000000000001]
[747869,"01:00:00","Fluminense","v","Atletico Goiani"," ","Brezilya","2 - 0","61.8","27.6","10.6",85,15,"1-0","63.6","21.2","15.1",81,19,null,3,"2 "," 0",2,"NOT OK",2,"1","0",1,"NOT OK","OYNAMA",0,61.8,27.6,10.6]
[747872,"01:00:00","Atletico Mineir","v","Santos"," ","Brezilya","2 - 0","51.3","30.8","17.8",74,26,"1-0","63","21.6","15.4",80,20,null,3,"2 "," 0",2,"NOT OK",2,"1","0",1,"NOT OK","OYNAMA",0,51.3,30.8,17.8]
[753005,"01:00:00","CSE","v","Santa Cruz"," ","Brezilya","1 - 0","41.9","38.1","20",67,33,"1-0","45.6","31.8","22.7",67,33,null,3,"1 "," 0",1,"NOT OK",2,"1","0",1,"NOT OK","OYNAMA",0,41.9,38.1,20]
[747216,"01:00:00","Oeste","v","Nova Iguaçu"," ","Brezilya","1 - 1","33.3","39.3","27.4",55,45,"0-0","34.7","38.1","27.2",56,44,null,3,"1 "," 1",2,"NOT OK",2,"0","0",0,"NOT OK","OYNAMA",0,33.299999999999997,39.299999999999997,27.4]
[747265,"01:00:00","Sint Maarten","v","Turks ve Caicos"," ","CONCACAF Ulusla","4 - 3","38.4","32.9","28.7",57,43,"2-2","35.9","37.4","26.7",57,43,null,3,"4 "," 3",7,"OK",2,"2","2",4,"OK","OYNA",0,38.4,32.9,28.7]
[757027,"01:00:00","Junior","v","Atletico Bucara"," ","Kolombiya","2 - 1","44.1","33.5","22.4",66,34,"1-0","45.5","31.8","22.7",67,33,null,3,"2 "," 1",3,"NOT OK",2,"1","0",1,"NOT OK","OYNAMA",0,44.1,33.5,22.4]
[714472,"01:30:00","Richmond Kicker","v","Charlotte Indep"," ","ABD","1 - 1","36.9","37.9","25.2",59,41,"1-0","37.9","36.2","25.9",59,41,null,3,"1 "," 1",2,"NOT OK",2,"1","0",1,"NOT OK","OYNAMA",0,36.9,37.9,25.2]
[747394,"02:00:00","Charleston Batt","v","Pittsburgh Rive"," ","ABD","1 - 2","21.3","31.5","47.2",31,69,"0-1","22","30.8","47.2",32,68,null,3,"1 "," 2",3,"NOT OK",2,"0","1",1,"NOT OK","OYNAMA",0,21.3,31.5,47.2]
[747397,"02:00:00","Miami FC","v","Tampa Bay Rowdi"," ","ABD","1 - 1","31.3","39.6","29.2",52,48,"1-1","34.9","38","27.1",56,44,null,3,"1 "," 1",2,"NOT OK",2,"1","1",2,"OK","OYNAMA",0,31.3,39.6,29.2]
[747400,"02:15:00","Zamora","v","Monagas"," ","Venezuela","2 - 0","47.9","32.9","19.2",71,29,"1-0","50","29.2","20.8",71,29,null,3,"2 "," 0",2,"NOT OK",2,"1","0",1,"NOT OK","OYNAMA",0,47.9,32.9,19.2]
[747395,"02:30:00","Atlanta United","v","Loudoun United"," ","ABD","2 - 2","35.1","35.6","29.3",55,45,"1-1","29.1","40.8","30.1",49,51,null,3,"2 "," 2",4,"OK",2,"1","1",2,"OK","OYNA",0,35.1,35.6,29.3]
[747399,"02:30:00","Detroit City","v","Sacramento Repu"," ","ABD","1 - 2","24","34.3","41.7",37,63,"0-1","23.4","32.8","43.7",35,65,null,3,"1 "," 2",3,"NOT OK",2,"0","1",1,"NOT OK","OYNAMA",0,24,34.299999999999997,41.7]
[763763,"02:30:00","River Plate","v","Atletico Tucuma"," ","Arjantin","4 - 0","73.1","17.5","9.5",89,11,"2-0","75.9","14.1","10",88,12,null,3,"4 "," 0",4,"OK",2,"2","0",2,"OK","OYNA",73.099999999999994,73.099999999999994,17.5,9.5]
[765150,"02:30:00","Montserrat","v","Bermuda"," ","CONCACAF Ulusla","2 - 3","25.5","31.6","42.9",37,63,"1-1","34.7","38.1","27.2",56,44,null,3,"2 "," 3",5,"OK",2,"1","1",2,"OK",{"$f":"IF(H52=\"\",\" \",IF(AND(Y52=\"OK\",AD52=\"OK\"),\"OYNA\",IF(Y52=AD52,\"OYNAMA\",IF(Y52=AD52,\"OYNA\",\"OYNAMA\"))))","v":"OYNA"},0,25.5,31.6,42.9]
[747389,"03:00:00","Nashville SC","v","San Jose Earthq"," ","ABD","3 - 1","47","30.3","22.7",67,33,"1-0","48.8","29.9","21.3",70,30,null,3,"3 "," 1",4,"OK",2,"1","0",1,"NOT OK","OYNAMA",0,47,30.3,22.7]
[747393,"03:00:00","Forward Madison","v","Greenville Triu"," ","ABD","1 - 1","33.6","41.5","24.8",58,42,"0-0","33.1","39","27.9",54,46,null,3,"1 "," 1",2,"NOT OK",2,"0","0",0,"NOT OK","OYNAMA",0,33.6,41.5,24.8]
[747850,"03:00:00","Central Norte","v","Racing Cordoba"," ","Arjantin","2 - 1","39.6","35.8","24.6",62,38,"1-0","51.1","28.5","20.4",72,28,null,3,"2 "," 1",3,"NOT OK",2,"1","0",1,"NOT OK","OYNAMA",0,39.6,35.799999999999997,24.6]
[747870,"03:00:00","Internacional","v","Flamengo"," ","Brezilya","2 - 1","44.9","32","23.1",66,34,"1-0","45","32.1","22.9",66,34,null,3,"2 "," 1",3,"NOT OK",2,"1","0",1,"NOT OK","OYNAMA",0,44.9,32,23.1]
[770741,"03:00:00","Ekvador","v","Mali"," ","Hazirlik","1 - 0","41.5","37.1","21.3",66,34,"0-0","33.9","38.5","27.5",55,45,null,3,"1 "," 0",1,"NOT OK",2,"0","0",0,"NOT OK","OYNAMA",0,41.5,37.1,21.3]
[757026,"03:30:00","Millonarios","v","Atletico Nacion"," ","Kolombiya","1 - 1","31.7","41.5","26.8",54,46,"1-0","39.7","35.2","25.1",61,39,null,3,"1 "," 1",2,"NOT OK",2,"1","0",1,"NOT OK","OYNAMA",0,31.7,41.5,26.8]
[747390,"04:00:00","Northern Colora","v","Tormenta"," ","ABD","1 - 2","20.6","30.1","49.3",30,70,"0-1","21.2","29.7","49.1",30,70,null,3,"1 "," 2",3,"NOT OK",2,"0","1",1,"NOT OK","OYNAMA",0,20.6,30.1,49.3]
[747975,"05:00:00","San Diego Loyal","v","Hartford Athlet"," ","ABD","2 - 1","41.2","33.1","25.7",62,38,"1-0","45.1","32","22.9",66,34,null,3,"2 "," 1",3,"NOT OK",2,"1","0",1,"NOT OK","OYNAMA",0,41.2,33.1,25.7]
[747978,"05:00:00","Oakland Roots","v","Rio Grande Vall"," ","ABD","2 - 2","35.2","36.7","28.1",56,44,"1-0","38.1","36.1","25.8",59,41,null,3,"2 "," 2",4,"OK",2,"1","0",1,"NOT OK","OYNAMA",0,35.200000000000003,36.700000000000003,28.1]
[747391,"05:00:00","Tucson","v","Union Omaha"," ","ABD","0 - 2","19.7","31.6","48.6",29,71,"0-1","18.1","25.4","56.4",24,76,null,3,"0 "," 2",2,"NOT OK",2,"0","1",1,"NOT OK","OYNAMA",0,19.7,31.6,48.6]
[747267,"05:00:00","Meksika","v","Surinam"," ","CONCACAF Ulusla","0 - 3","2.3","15.9","81.8",3,97,"0-1","6.2","8.7","85.1",7,93,null,3,"0 "," 3",3,"NOT OK",2,"0","1",1,"NOT OK","OYNAMA",81.8,2.2999999999999998,15.9,81.8]
[747979,"05:30:00","Las Vegas Light","v","Orange County S"," ","ABD","1 - 2","23.5","31.8","44.7",34,66,"0-1","23.1","32.3","44.6",34,66,null,3,"1 "," 2",3,"NOT OK",2,"0","1",1,"NOT OK","OYNAMA",0,23.5,31.8,44.7]
[747976,"05:30:00","Phoenix Rising","v","El Paso Locomot"," ","ABD","2 - 2","29.8","37.2","33.1",47,53,"1-1","32.9","39.1","28",54,46,null,3,"2 "," 2",4,"OK",2,"1","1",2,"OK","OYNA",0,29.8,37.200000000000003,33.1]
[747977,"05:30:00","LA Galaxy II","v","Colorado Spring"," ","ABD","2 - 2","28.3","36.3","35.4",45,55,"0-1","25.6","35.9","38.5",40,60,null,3,"2 "," 2",4,"OK",2,"0","1",1,"NOT OK","OYNAMA",0,28.3,36.299999999999997,35.4]
[747392,"05:30:00","Central Valley","v","Chattanooga Red"," ","ABD","1 - 1","28.9","39.9","31.2",48,52,"0-0","31.4","40","28.6",52,48,null,3,"1 "," 1",2,"NOT OK",2,"0","0",0,"NOT OK","OYNAMA",0,28.9,39.9,31.2]
[747860,"07:00:00","Valentine Phoen","v","Adamstown Roseb"," ","Avustralya","3 - 1","47.1","30.6","22.3",68,32,"1-0","43.4","33","23.6",65,35,null,3,"3 "," 1",4,"OK",2,"1","0",1,"NOT OK","OYNAMA",0,{"$f":"IF(H68=\"\",\"0\",SUBSTITUTE(I68,\".\",\",\"))*1","v":47.1},30.6,22.3]
[747922,"07:00:00","Renofa Yamaguch","v","Fagiano Okayama"," ","Japonya","1 - 1","23.5","39.3","37.2",39,61,"0-1","23.6","33","43.4",35,65,null,3,"1 "," 1",2,"NOT OK",2,"0","1",1,"NOT OK","OYNAMA",0,23.5,39.299999999999997,37.200000000000003]
[747930,"07:00:00","Azul Claro Numa","v","Yokohama SCC"," ","Japonya","2 - 1","46","32.3","21.7",68,32,"1-0","42.9","33.3","23.8",64,36,null,3,"2 "," 1",3,"NOT OK",2,"1","0",1,"NOT OK","OYNAMA",0,46,32.299999999999997,21.7]
[747866,"08:00:00","Blacktown City","v","APIA Leichhardt"," ","Avustralya","2 - 1","41.5","33.2","25.3",62,38,"1-0","50.2","29.1","20.8",71,29,null,3,"2 "," 1",3,"NOT OK",2,"1","0",1,"NOT OK","OYNAMA",0,41.5,33.200000000000003,25.3]
[747867,"08:00:00","Sydney United","v","North Shore Mar"," ","Avustralya","2 - 2","32.4","36.9","30.7",51,49,"1-1","26.8","37.5","35.7",43,57,null,3,"2 "," 2",4,"OK",2,"1","1",2,"OK","OYNA",0,32.4,36.9,30.7]
[747924,"08:00:00","Machida Zelvia","v","Roasso Kumamoto"," ","Japonya","1 - 0","41.4","37.4","21.3",66,34,"1-0","44.2","32.6","23.3",65,35,null,3,"1 "," 0",1,"NOT OK",2,"1","0",1,"NOT OK","OYNAMA",0,41.4,37.4,21.3]
[747925,"08:00:00","Blaublitz Akita","v","Omiya Ardija"," ","Japonya","0 - 1","19.7","33.9","46.4",30,70,"0-1","17.1","24","58.9",23,77,null,3,"0 "," 1",1,"NOT OK",2,"0","1",1,"NOT OK","OYNAMA",0,19.7,33.9,46.4]
[747926,"08:00:00","Mito HollyHock","v","Montedio Yamaga"," ","Japonya","1 - 1","29.5","41.6","28.9",51,49,"0-0","29.1","40.7","30.2",49,51,null,3,"1 "," 1",2,"NOT OK",2,"0","0",0,"NOT OK","OYNAMA",0,29.5,41.6,28.9]
[747927,"08:00:00","Tegevajaro Miya","v","Kataller Toyama"," ","Japonya","2 - 1","51.6","29.2","19.2",73,27,"1-0","55.2","26.1","18.7",75,25,null,3,"2 "," 1",3,"NOT OK",2,"1","0",1,"NOT OK","OYNAMA",0,51.6,29.2,19.2]
[747928,"08:00:00","Vanraure Hachin","v","Gainare Tottori"," ","Japonya","2 - 0","43.8","34.3","21.8",67,33,"1-0","52.5","27.7","19.8",73,27,null,3,"2 "," 0",2,"NOT OK",2,"1","0",1,"NOT OK","OYNAMA",0,43.8,34.299999999999997,21.8]
[747931,"08:00:00","FC Gifu","v","Kagoshima Unite"," ","Japonya","0 - 2","18.8","31.6","49.6",27,73,"0-1","16.1","22.5","61.4",21,79,null,3,"0 "," 2",2,"NOT OK",2,"0","1",1,"NOT OK","OYNAMA",0,18.8,31.6,49.6]
[747932,"08:00:00","Kamatamare Sanu","v","Iwaki"," ","Japonya","1 - 1","34.5","39.1","26.5",57,43,"1-0","39.1","35.5","25.4",61,39,null,3,"1 "," 1",2,"NOT OK",2,"1","0",1,"NOT OK","OYNAMA",0,34.5,39.1,26.5]
[747933,"08:00:00","Giravanz Kitaky","v","Fukushima Unite"," ","Japonya","1 - 0","39.5","37.1","23.4",63,37,"1-0","40.6","34.6","24.7",62,38,null,3,"1 "," 0",1,"NOT OK",2,"1","0",1,"NOT OK","OYNAMA",0,39.5,37.1,23.4]
[747837,"09:00:00","Rockdale City S","v","Marconi Stallio"," ","Avustralya","1 - 2","23.2","32.5","44.3",34,66,"0-1","24.3","34","41.8",37,63,null,3,"1 "," 2",3,"NOT OK",2,"0","1",1,"NOT OK","OYNAMA",0,23.2,32.5,44.3]
[747960,"10:00:00","Siheung Citizen","v","Gangneung City"," ","Güney Kore","2 - 1","40.9","33.7","25.4",62,38,"1-0","50","29.2","20.8",71,29,null,3,"2 "," 1",3,"NOT OK",2,"1","0",1,"NOT OK","OYNAMA",0,40.9,33.700000000000003,25.4]
[747934,"10:00:00","Parceiro Nagano","v","Ehime FC"," ","Japonya","1 - 1","22.3","39.7","37.9",37,63,"0-1","23.8","33.3","42.9",36,64,null,3,"1 "," 1",2,"NOT OK",2,"0","1",1,"NOT OK","OYNAMA",0,22.3,39.700000000000003,37.9]
[747929,"10:00:00","Imabari","v","Sagamihara"," ","Japonya","0 - 1","23.7","37.2","39.1",38,62,"0-1","24.1","33.7","42.2",36,64,null,3,"0 "," 1",1,"NOT OK",2,"0","1",1,"NOT OK","OYNAMA",0,23.7,37.200000000000003,39.1]
[747959,"11:00:00","Yangju Citizen","v","Busan Transport"," ","Güney Kore","0 - 1","19.2","36.6","44.2",30,70,"0-1","23.8","33.3","42.9",36,64,null,3,"0 "," 1",1,"NOT OK",2,"0","1",1,"NOT OK","OYNAMA",0,19.2,36.6,44.2]
[747957,"12:00:00","Seoul E-Land","v","Busan I Park"," ","Güney Kore","1 - 2","24.4","33","42.6",37,63,"0-1","25.5","35.6","38.9",40,60,null,3,"1 "," 2",3,"NOT OK",2,"0","1",1,"NOT OK","OYNAMA",0,24.4,33,42.6]
[747923,"12:00:00","ThespaKusatsu G","v","Tochigi SC"," ","Japonya","1 - 0","47.8","35.1","17.1",74,26,"1-0","52.3","27.8","19.9",72,28,null,3,"1 "," 0",1,"NOT OK",2,"1","0",1,"NOT OK","OYNAMA",0,47.8,35.1,17.100000000000001]
[747921,"12:00:00","Tokyo Verdy","v","Grulla Morioka"," ","Japonya","2 - 1","39.7","35.2","25.1",61,39,"1-0","41.5","34.1","24.4",63,37,null,3,"2 "," 1",3,"NOT OK",2,"1","0",1,"NOT OK","OYNAMA",0,39.700000000000003,35.200000000000003,25.1]
[764347,"12:30:00","Guangzhou R&F","v","Shandong Taisha"," ","Çin Halk C","1 - 3","18.9","26.7","54.4",26,74,"0-2","18.1","25.4","56.5",24,76,null,3,"1 "," 3",4,"OK",2,"0","2",2,"OK","OYNA",0,18.899999999999999,26.7,54.4]
[747958,"14:00:00","Jeonnam Dragons","v","Gyeongnam FC"," ","Güney Kore","2 - 1","37.4","36.3","26.4",59,41,"1-1","32","39.7","28.3",53,47,null,3,"2 "," 1",3,"NOT OK",2,"1","1",2,"OK","OYNAMA",0,37.4,36.299999999999997,26.4]
[747940,"14:00:00","Floro SK","v","Hönefoss BK"," ","Norveç","3 - 2","40","33.4","26.5",60,40,"1-1","35.6","37.6","26.8",57,43,null,3,"3 "," 2",5,"OK",2,"1","1",2,"OK","OYNA",0,40,33.4,26.5]
[747943,"14:00:00","Stromsgodset II","v","Skjervoy"," ","Norveç","5 - 0","79.9","13.8","6.3",93,7,"2-0","67.9","18.7","13.4",84,16,null,3,"5 "," 0",5,"OK",2,"2","0",2,"OK","OYNA",{"$f":"IF(H92=\"\",\"0\",IF(OR(AG92>=65,AH92>=55,AI92>=65),MAX(AG92:AI92),0))*1","v":79.900000000000006},79.900000000000006,13.8,6.3]
[764348,"14:30:00","Changchun YaTai","v","Dalian Pro"," ","Çin Halk C","2 - 0","50.4","30.7","18.9",73,27,"1-0","61.4","22.5","16.1",79,21,null,{"$f":"IF(H93=\"\",\" \",SEARCH(\"-\",H93))","v":3},{"$f":"IF(H93=\"\",\" \",LEFT(H93,U93-1))","v":"2 "},{"$f":"IF(H93=\"\",\" \",MID(H93,U93+1,4))","v":" 0"},{"$f":"IF(H93=\"\",\" \",V93+W93)","v":2},{"$f":"IF(H93=\"\",\" \",IF(X93>=4,\"OK\",\"NOT OK\"))","v":"NOT OK"},{"$f":"IF(N93=\"\",\" \",SEARCH(\"-\",N93))","v":2},{"$f":"IF(N93=\"\",\" \",LEFT(N93,Z93-1))","v":"1"},{"$f":"IF(N93=\"\",\" \",MID(N93,Z93+1,4))","v":"0"},{"$f":"IF(N93=\"\",\" \",AA93+AB93)","v":1},{"$f":"IF(N93=\"\",\" \",IF(AC93>=2,\"OK\",\"NOT OK\"))","v":"NOT OK"},{"$f":"IF(H93=\"\",\" \",IF(AND(Y93=\"OK\",AD93=\"OK\"),\"OYNA\",IF(Y93=AD93,\"OYNAMA\",IF(Y93=AD93,\"OYNA\",\"OYNAMA\"))))","v":"OYNAMA"},0,{"$f":"IF(H93=\"\",\"0\",SUBSTITUTE(I93,\".\",\",\"))*1","v":50.4},{"$f":"IF(H93=\"\",\"0\",SUBSTITUTE(J93,\".\",\",\"))*1","v":30.7},{"$f":"IF(H93=\"\",\"0\",SUBSTITUTE(K93,\".\",\",\"))*1","v":18.899999999999999}]
[764354,"14:30:00","Cangzhou Mighty","v","Chengdu Qianbao"," ","Çin Halk C","2 - 1","51.1","29.4","19.5",72,28,"1-0","52.1","27.9","19.9",72,28,null,3,"2 "," 1",3,"NOT OK",2,"1","0",1,"NOT OK","OYNAMA",0,51.1,29.4,19.5]
[764358,"14:30:00","Shanghai Shenhu","v","Wuhan Three Tow"," ","Çin Halk C","1 - 0","45","37.1","17.9",71,29,"1-0","50.1","29.1","20.8",71,29,null,3,"1 "," 0",1,"NOT OK",2,"1","0",1,"NOT OK","OYNAMA",0,45,37.1,17.899999999999999]
[763323,"15:00:00","Progress / AFA","v","Grobina"," ","Letonya","7 - 0","78.4","13.8","7.7",91,9,"2-0","56.1","25.6","18.3",75,25,null,3,"7 "," 0",7,"OK",2,"2","0",2,"OK","OYNA",78.400000000000006,78.400000000000006,13.8,7.7]
[747938,"15:00:00","Notodden","v","Staal Jorpeland"," ","Norveç","2 - 1","38","35.5","26.5",59,41,"1-0","38.9","35.6","25.5",60,40,null,3,"2 "," 1",3,"NOT OK",2,"1","0",1,"NOT OK","OYNAMA",0,38,35.5,26.5]
[747941,"15:30:00","SF Grei","v","Fyllingsdalen"," ","Norveç","3 - 2","40.9","33.1","26",61,39,"1-0","43.3","33.1","23.6",65,35,null,3,"3 "," 2",5,"OK",2,"1","0",1,"NOT OK","OYNAMA",0,40.9,33.1,26]
[747281,"16:00:00","Güney Kore U23","v","Japonya U23"," ","AFC U23 Sampiyo","2 - 2","32.8","37.1","30.1",52,48,"1-1","35.7","37.5","26.8",57,43,null,3,"2 "," 2",4,"OK",2,"1","1",2,"OK","OYNA",0,32.799999999999997,37.1,30.1]
[747970,"16:00:00","Pitea IF","v","Vasalund IF"," ","Isveç","1 - 2","23.4","32.4","44.3",34,66,"0-1","23.2","32.5","44.3",34,66,null,3,"1 "," 2",3,"NOT OK",2,"0","1",1,"NOT OK","OYNAMA",0,23.4,32.4,44.3]
[747971,"16:00:00","Haninge","v","Umea FC"," ","Isveç","1 - 1","27.4","36.8","35.8",43,57,"0-1","25.7","35.9","38.4",40,60,null,3,"1 "," 1",2,"NOT OK",2,"0","1",1,"NOT OK","OYNAMA",0,27.4,36.799999999999997,35.799999999999997]
[747942,"16:00:00","Mjöndalen II","v","Gjellerasen"," ","Norveç","2 - 2","33.1","37.3","29.6",53,47,"1-0","42.3","33.7","24",64,36,null,3,"2 "," 2",4,"OK",2,"1","0",1,"NOT OK","OYNAMA",0,33.1,37.299999999999997,29.6]
[747944,"16:00:00","Senja Silsand","v","Lorenskog"," ","Norveç","2 - 1","38.9","34.3","26.8",59,41,"1-0","37.3","36.6","26.1",59,41,null,3,"2 "," 1",3,"NOT OK",2,"1","0",1,"NOT OK","OYNAMA",0,38.9,34.299999999999997,26.8]
[747945,"16:00:00","Lilleström II","v","Bossekop"," ","Norveç","3 - 1","58.3","25","16.7",78,22,"2-0","59.9","23.4","16.7",78,22,null,3,"3 "," 1",4,"OK",2,"2","0",2,"OK","OYNA",0,58.3,25,16.7]
[747915,"16:00:00","Kuzey Irlanda","v","Güney Kibris"," ","UEFA Uluslar Li","1 - 0","38.2","37.2","24.6",61,39,"1-0","37.9","36.2","25.9",60,40,null,3,"1 "," 0",1,"NOT OK",2,"1","0",1,"NOT OK","OYNAMA",0,38.200000000000003,37.200000000000003,24.6]
[747952,"16:30:00","Byasen","v","Bodo / Glimt II"," ","Norveç","3 - 2","39.7","33.4","26.9",60,40,"1-0","40.9","34.5","24.6",63,38,null,3,"3 "," 2",5,"OK",2,"1","0",1,"NOT OK","OYNAMA",0,39.700000000000003,33.4,26.9]
[747954,"16:30:00","Trygg/Lade","v","Innstranden"," ","Norveç","7 - 2","58.9","22.6","18.4",76,24,"3-1","53.7","27","19.3",74,26,null,3,"7 "," 2",9,"OK",2,"3","1",4,"OK","OYNA",0,58.9,22.6,18.399999999999999]
[747183,"17:00:00","Novorizontino","v","Guarani FC"," ","Brezilya","1 - 1","21.3","42.4","36.3",37,63,"0-1","23.8","33.3","42.9",35,65,null,3,"1 "," 1",2,"NOT OK",2,"0","1",1,"NOT OK","OYNAMA",0,21.3,42.4,36.299999999999997]
[747939,"17:00:00","Moss","v","Arendal"," ","Norveç","3 - 1","50.2","29","20.8",71,29,"1-0","45.8","31.6","22.6",67,33,null,3,"3 "," 1",4,"OK",2,"1","0",1,"NOT OK","OYNAMA",0,50.2,29,20.8]
[747946,"17:00:00","Mjolner","v","Harstad"," ","Norveç","3 - 1","44","31.8","24.1",65,35,"1-1","36.7","36.9","26.4",58,42,null,3,"3 "," 1",4,"OK",2,"1","1",2,"OK","OYNA",0,44,31.8,24.1]
[747338,"17:00:00","Deportivo Santa","v","Guaraní de Trin"," ","Paraguay","1 - 1","36","40.2","23.9",60,40,"1-0","44.3","32.5","23.2",65,35,null,3,"1 "," 1",2,"NOT OK",2,"1","0",1,"NOT OK","OYNAMA",0,36,40.200000000000003,23.9]
[747339,"17:00:00","Fernando De La","v","3 de Febrero"," ","Paraguay","1 - 1","36.3","39.3","24.4",60,40,"1-0","37.8","36.3","25.9",59,41,null,3,"1 "," 1",2,"NOT OK",2,"1","0",1,"NOT OK","OYNAMA",0,36.299999999999997,39.299999999999997,24.4]
[765061,"18:00:00","Ermenistan U21","v","Ukrayna U21"," ","Avrupa U21 Samp","0 - 4","10","18","72",12,88,"0-2","8.7","12.2","79.1",10,90,null,3,"0 "," 4",4,"OK",2,"0","2",2,"OK","OYNA",72,10,18,72]
[747955,"18:00:00","Kjelsas","v","SK Traeff"," ","Norveç","3 - 2","36.4","35","28.6",56,44,"2-1","37.8","36.3","25.9",59,41,null,3,"3 "," 2",5,"OK",2,"2","1",3,"OK","OYNA",0,36.4,35,28.6]
[747897,"18:30:00","PeKa","v","NJS"," ","Finlandiya","2 - 0","58.6","27.9","13.4",81,19,"1-0","55.1","26.2","18.7",75,25,null,3,"2 "," 0",2,"NOT OK",2,"1","0",1,"NOT OK","OYNAMA",0,58.6,27.9,13.4]
[747900,"18:30:00","GrIFK","v","Tampere United"," ","Finlandiya","3 - 2","35.6","35","29.3",55,45,"1-1","28.8","40.3","31",48,52,null,3,"3 "," 2",5,"OK",2,"1","1",2,"OK","OYNA",0,35.6,35,29.3]
[747899,"18:30:00","Jaro","v","Gnistan"," ","Finlandiya","2 - 1","41.7","34","24.3",63,37,"1-0","40.9","34.5","24.6",63,37,null,3,"2 "," 1",3,"NOT OK",2,"1","0",1,"NOT OK","OYNAMA",0,41.7,34,24.3]
[763760,"19:00:00","Colon","v","Union Santa Fe"," ","Arjantin","0 - 1","21.9","38.6","39.5",36,64,"0-1","25.2","35.3","39.6",39,61,null,3,"0 "," 1",1,"NOT OK",2,"0","1",1,"NOT OK","OYNAMA",0,21.9,38.6,39.5]
[747956,"19:00:00","Ullensaker / Ki","v","Brattvag IL"," ","Norveç","2 - 1","44.5","32.5","23",66,34,"1-0","44","32.7","23.3",65,35,null,3,"2 "," 1",3,"NOT OK",2,"1","0",1,"NOT OK","OYNAMA",0,44.5,32.5,23]
[747911,"19:00:00","Norveç","v","Isveç"," ","UEFA Uluslar Li","1 - 2","25.7","35.9","38.5",40,60,"0-1","25.3","35.4","39.3",39,61,null,3,"1 "," 2",3,"NOT OK",2,"0","1",1,"NOT OK","OYNAMA",0,25.7,35.9,38.5]
[747912,"19:00:00","Kuzey Makedonya","v","Cebelitarik"," ","UEFA Uluslar Li","1 - 0","40.9","38.1","21",66,34,"1-0","44.7","32.2","23",66,34,null,3,"1 "," 0",1,"NOT OK",2,"1","0",1,"NOT OK","OYNAMA",0,40.9,38.1,21]
[747913,"19:00:00","Gürcistan","v","Bulgaristan"," ","UEFA Uluslar Li","2 - 0","51.2","30.9","17.9",74,26,"1-0","57.4","24.8","17.7",76,24,null,3,"2 "," 0",2,"NOT OK",2,"1","0",1,"NOT OK","OYNAMA",0,51.2,30.9,17.899999999999999]
[747137,"20:00:00","Club Atletico M","v","Estudiantes Cas"," ","Arjantin","0 - 1","18.8","35","46.2",29,71,"0-1","24.8","34.7","40.6",38,62,null,3,"0 "," 1",1,"NOT OK",2,"0","1",1,"NOT OK","OYNAMA",0,18.8,35,46.2]
[747136,"20:05:00","Deportivo Madry","v","Belgrano Cordob"," ","Arjantin","0 - 2","15.5","29","55.4",22,78,"0-1","16.9","23.6","59.5",22,78,null,3,"0 "," 2",2,"NOT OK",2,"0","1",1,"NOT OK","OYNAMA",0,15.5,29,55.4]
[747140,"21:00:00","Deportivo Maipu","v","San Telmo"," ","Arjantin","2 - 0","52.4","29.5","18.2",74,26,"1-0","57.9","24.6","17.6",77,23,null,3,"2 "," 0",2,"NOT OK",2,"1","0",1,"NOT OK","OYNAMA",0,52.4,29.5,18.2]
[763748,"21:30:00","Godoy Cruz","v","Racing Club"," ","Arjantin","0 - 2","21.6","34","44.3",33,67,"0-1","25.1","35.2","39.7",39,61,null,3,"0 "," 2",2,"NOT OK",2,"0","1",1,"NOT OK","OYNAMA",0,21.6,34,44.3]
[747135,"21:30:00","Deportivo Moron","v","Villa Dalmine"," ","Arjantin","1 - 1","30.1","41.2","28.7",51,49,"1-0","41.5","34.1","24.4",63,37,null,3,"1 "," 1",2,"NOT OK",2,"1","0",1,"NOT OK","OYNAMA",0,30.1,41.2,28.7]
[747126,"21:30:00","Sacachispas","v","Ramon Santamari"," ","Arjantin","2 - 0","73.2","21.3","5.5",93,7,"1-0","73.3","15.6","11.1",87,13,null,3,"2 "," 0",2,"NOT OK",2,"1","0",1,"NOT OK","OYNAMA",73.2,73.2,21.3,5.5]
[747917,"21:45:00","Ispanya","v","Çekya"," ","UEFA Uluslar Li","2 - 0","58.5","28.5","13",82,18,"1-0","65.3","20.3","14.5",82,18,null,3,"2 "," 0",2,"NOT OK",2,"1","0",1,"NOT OK","OYNAMA",0,58.5,28.5,13]
[747918,"21:45:00","Isviçre","v","Portekiz"," ","UEFA Uluslar Li","2 - 1","46","32.4","21.7",68,32,"1-0","45.3","31.9","22.8",66,34,null,3,"2 "," 1",3,"NOT OK",2,"1","0",1,"NOT OK","OYNAMA",0,46,32.4,21.7]
[747910,"21:45:00","Slovenya","v","Sirbistan"," ","UEFA Uluslar Li","0 - 1","25","36.8","38.2",39,61,"0-1","25.2","35.2","39.6",39,61,null,3,"0 "," 1",1,"NOT OK",2,"0","1",1,"NOT OK","OYNAMA",0,25,36.799999999999997,38.200000000000003]
[747914,"21:45:00","Yunanistan","v","Kosova"," ","UEFA Uluslar Li","1 - 0","45.9","34.3","19.8",70,30,"1-0","48.5","30","21.4",69,31,null,3,"1 "," 0",1,"NOT OK",2,"1","0",1,"NOT OK","OYNAMA",0,45.9,34.299999999999997,19.8]
[747916,"21:45:00","Malta","v","San Marino"," ","UEFA Uluslar Li","3 - 0","81.4","15.5","3.1",96,4,"1-0","83.2","9.8","7",92,8,null,3,"3 "," 0",3,"NOT OK",2,"1","0",1,"NOT OK","OYNAMA",81.400000000000006,81.400000000000006,15.5,3.1]
[747974,"22:00:00","Sporting Kansas","v","New England Rev"," ","ABD","2 - 1","40","33.9","26.1",61,39,"1-1","36.1","37.3","26.6",57,43,null,3,"2 "," 1",3,"NOT OK",2,"1","1",2,"OK","OYNAMA",0,40,33.9,26.1]
[747123,"22:00:00","Alvarado","v","Club Atletico G"," ","Arjantin","1 - 0","50.6","33.9","15.4",77,23,"1-0","48.4","30.1","21.5",69,31,null,3,"1 "," 0",1,"NOT OK",2,"1","0",1,"NOT OK","OYNAMA",0,50.6,33.9,15.4]
[747139,"22:00:00","Estudiantes Rio","v","Deportivo Riest"," ","Arjantin","1 - 0","49.1","33.1","17.9",73,27,"1-0","52.7","27.6","19.7",73,27,null,3,"1 "," 0",1,"NOT OK",2,"1","0",1,"NOT OK","OYNAMA",0,49.1,33.1,17.899999999999999]
[747873,"22:00:00","Goias","v","Ceara"," ","Brezilya","0 - 2","18.6","31.8","49.6",27,73,"0-1","19.7","27.6","52.8",27,73,null,3,"0 "," 2",2,"NOT OK",2,"0","1",1,"NOT OK","OYNAMA",0,18.600000000000001,31.8,49.6]
[747877,"22:00:00","Sao Paulo","v","America Mineiro"," ","Brezilya","2 - 0","65.2","23.3","11.6",85,15,"1-0","74.4","14.9","10.6",87,13,null,3,"2 "," 0",2,"NOT OK",2,"1","0",1,"NOT OK","OYNAMA",65.2,65.2,23.3,11.6]
[747178,"22:00:00","Vasco da Gama","v","Cruzeiro"," ","Brezilya","0 - 2","17","29.3","53.7",24,76,"0-1","20.5","28.6","50.9",28,72,null,3,"0 "," 2",2,"NOT OK",2,"0","1",1,"NOT OK","OYNAMA",0,17,29.3,53.7]
[747129,"22:10:00","Temperley","v","Almirante Brown"," ","Arjantin","2 - 0","49.4","32.1","18.6",73,27,"1-0","40.3","34.8","24.9",62,38,null,3,"2 "," 0",2,"NOT OK",2,"1","0",1,"NOT OK","OYNAMA",0,49.4,32.1,18.600000000000001]
[765556,"22:15:00","Palermo","v","Padova Calcio"," ","Italya","2 - 0","52.1","30.2","17.7",75,25,"1-0","66.6","19.5","13.9",83,17,null,3,"2 "," 0",2,"NOT OK",2,"1","0",1,"NOT OK","OYNAMA",0,52.1,30.2,17.7]
[747906,"23:00:00","Küba","v","Antigua Ve Barb"," ","CONCACAF Ulusla","5 - 0","87.1","10.9","2",98,2,"2-0","90.2","5.7","4.1",96,4,null,3,"5 "," 0",5,"OK",2,"2","0",2,"OK","OYNA",87.1,87.1,10.9,2]
[757030,"23:00:00","Envigado","v","La Equidad"," ","Kolombiya","0 - 1","22.5","37.6","39.9",36,64,"0-1","24.3","34","41.7",37,63,null,3,"0 "," 1",1,"NOT OK",2,"0","1",1,"NOT OK","OYNAMA",0,22.5,37.6,39.9]
[768865,"23:30:00","Guairena","v","General Caballe"," ","Paraguay","3 - 0","62","24.1","13.9",82,18,"1-0","50.3","29","20.7",71,29,null,3,"3 "," 0",3,"NOT OK",2,"1","0",1,"NOT OK","OYNAMA",0,62,24.1,13.9]
[null,null,null,null,null,null,null,null,null,null,null,null,null,null,null,null,null,null,null,null," "," "," "," "," "," "," "," "," "," "," ",0,0,0,0]
[null,null,null,null,null,null,null,null,null,null,null,null,null,null,null,null,null,null,null,null," "," "," "," "," "," "," "," "," "," "," ",0,0,0,0]
[null,null,null,null,null,null,null,null,null,null,null,null,null,null,"27.9","39.1","33",46,54,null," "," "," "," "," "," "," "," "," "," "," ",0,0,0,0]
[null,null,null,null,null,null,null,null,null,null,null,null,null,null,"47.3","30.7","21.9",68,32,null," "," "," "," "," "," "," "," "," "," "," ",0,0,0,0]
[null,null,null,null,null,null,null,null,null,null,null,null,null,null,"8.7","12.2","79",10,90,null," "," "," "," "," "," "," "," "," "," "," ",0,0,0,0]
[null,null,null,null,null,null,null,null,null,null,null,null,null,null,"53.7","27","19.3",73,27,null," "," "," "," "," "," "," "," "," "," "," ",0,0,0,0]
[null,null,null,null,null,null,null,null,null,null,null,null,null,null,"27","37.8","35.2",43,57,null," "," "," "," "," "," "," "," "," "," "," ",0,0,0,0]
[null,null,null,null,null,null,null,null,null,null,null,null,null,null,"25.1","35.1","39.8",39,61,null," "," "," "," "," "," "," "," "," "," "," ",{"$f":"IF(H152=\"\",\"0\",IF(OR(AG152>=65,AH152>=55,AI152>=65),MAX(AG152:AI152),0))*1","v":0},0,0,0]
[null,null,null,null,null,null,null,null,null,null,null,null,null,null,"40.8","34.5","24.7",62,38,null,{"$f":"IF(H153=\"\",\" \",SEARCH(\"-\",H153))","v":" "},{"$f":"IF(H153=\"\",\" \",LEFT(H153,U153-1))","v":" "},{"$f":"IF(H153=\"\",\" \",MID(H153,U153+1,4))","v":" "},{"$f":"IF(H153=\"\",\" \",V153+W153)","v":" "},{"$f":"IF(H153=\"\",\" \",IF(X153>=4,\"OK\",\"NOT OK\"))","v":" "},{"$f":"IF(N153=\"\",\" \",SEARCH(\"-\",N153))","v":" "},{"$f":"IF(N153=\"\",\" \",LEFT(N153,Z153-1))","v":" "},{"$f":"IF(N153=\"\",\" \",MID(N153,Z153+1,4))","v":" "},{"$f":"IF(N153=\"\",\" \",AA153+AB153)","v":" "},{"$f":"IF(N153=\"\",\" \",IF(AC153>=2,\"OK\",\"NOT OK\"))","v":" "},{"$f":"IF(H153=\"\",\" \",IF(AND(Y153=\"OK\",AD153=\"OK\"),\"OYNA\",IF(Y153=AD153,\"OYNAMA\",IF(Y153=AD153,\"OYNA\",\"OYNAMA\"))))","v":" "},0,{"$f":"IF(H153=\"\",\"0\",SUBSTITUTE(I153,\".\",\",\"))*1","v":0},{"$f":"IF(H153=\"\",\"0\",SUBSTITUTE(J153,\".\",\",\"))*1","v":0},{"$f":"IF(H153=\"\",\"0\",SUBSTITUTE(K153,\".\",\",\"))*1","v":0}]
[null,null,null,null,null,null,null,null,null,null,null,null,null,null,"31.3","40.1","28.6",52,48,null," "," "," "," "," "," "," "," "," "," "," ",0,0,0,0]
[null,null,null,null,null,null,null,null,null,null,null,null,null,null,"35.8","37.5","26.8",57,43,null," "," "," "," "," "," "," "," "," "," "," ",0,0,0,0]
[null,null,null,null,null,null,null,null,null,null,null,null,null,null,"30.1","40.8","29.1",51,49,null," "," "," "," "," "," "," "," "," "," "," ",0,0,0,0]
[null,null,null,null,null,null,null,null,null,null,null,null,null,null,"22.3","31.3","46.4",33,67,null," "," "," "," "," "," "," "," "," "," "," ",0,0,0,0]
[null,null,null,null,null,null,null,null,null,null,null,null,null,null,"56.6","25.3","18.1",76,24,null," "," "," "," "," "," "," "," "," "," "," ",0,0,0,0]
[null,null,null,null,null,null,null,null,null,null,null,null,null,null,"5.4","7.5","87.1",6,94,null," "," "," "," "," "," "," "," "," "," "," ",0,0,0,0]
[null,null,null,null,null,null,null,null,null,null,null,null,null,null,"48.8","29.9","21.3",70,30,null," "," "," "," "," "," "," "," "," "," "," ",0,0,0,0]
[null,null,null,null,null,null,null,null,null,null,null,null,null,null,"64.9","20.5","14.6",82,18,null," "," "," "," "," "," "," "," "," "," "," ",0,0,0,0]
[null,null,null,null,null,null,null,null,null,null,null,null,null,null,"51.8","28.1","20.1",72,28,null," "," "," "," "," "," "," "," "," "," "," ",0,0,0,0]
[null,null,null,null,null,null,null,null,null,null,null,null,null,null,"58.9","24","17.1",77,23,null," "," "," "," "," "," "," "," "," "," "," ",0,0,0,0]
[null,null,null,null,null,null,null,null,null,null,null,null,null,null,"37.8","36.3","25.9",59,41,null," "," "," "," "," "," "," "," "," "," "," ",0,0,0,0]
[null,null,null,null,null,null,null,null,null,null,null,null,null,null,"36.8","36.9","26.3",58,42,null," "," "," "," "," "," "," "," "," "," "," ",0,0,0,0]
[null,null,null,null,null,null,null,null,null,null,null,null,null,null,"64.6","20.6","14.7",81,19,null," "," "," "," "," "," "," "," "," "," "," ",0,0,0,0]
[null,null,null,null,null,null,null,null,null,null,null,null,null,null,"57.2","25","17.8",76,24,null," "," "," "," "," "," "," "," "," "," "," ",0,0,0,0]
[null,null,null,null,null,null,null,null,null,null,null,null,null,null,"58","24.5","17.5",77,23,null," "," "," "," "," "," "," "," "," "," "," ",0,0,0,0]
[null,null,null,null,null,null,null,null,null,null,null,null,null,null,"21.6","30.2","48.2",31,69,null," "," "," "," "," "," "," "," "," "," "," ",0,0,0,0]
[null,null,null,null,null,null,null,null,null,null,null,null,null,null,"52.7","27.6","19.7",73,27,null," "," "," "," "," "," "," "," "," "," "," ",0,0,0,0]
[null,null,null,null,null,null,null,null,null,null,null,null,null,null,"27.8","38.9","33.4",46,54,null," "," "," "," "," "," "," "," "," "," "," ",0,0,0,0]
[null,null,null,null,null,null,null,null,null,null,null,null,null,null,"21.9","30.7","47.3",32,68,null," "," "," "," "," "," "," "," "," "," "," ",0,0,0,0]
[null,null,null,null,null,null,null,null,null,null,null,null,null,null,"60.9","22.8","16.3",79,21,null," "," "," "," "," "," "," "," "," "," "," ",0,0,0,0]
[null,null,null,null,null,null,null,null,null,null,null,null,null,null,"27.5","38.5","34",44,56,null," "," "," "," "," "," "," "," "," "," "," ",0,0,0,0]
[null,null,null,null,null,null,null,null,null,null,null,null,null,null,"41.6","34.1","24.3",63,37,null," "," "," "," "," "," "," "," "," "," "," ",0,0,0,0]
[null,null,null,null,null,null,null,null,null,null,null,null,null,null,"59","23.9","17.1",77,23,null," "," "," "," "," "," "," "," "," "," "," ",0,0,0,0]
[null,null,null,null,null,null,null,null,null,null,null,null,null,null,"14.3","20","65.7",18,82,null," "," "," "," "," "," "," "," "," "," "," ",0,0,0,0]
[null,null,null,null,null,null,null,null,null,null,null,null,null,null,"37.2","36.6","26.2",58,42,null," "," "," "," "," "," "," "," "," "," "," ",0,0,0,0]
[null,null,null,null,null,null,null,null,null,null,null,null,null,null,"14.4","20.2","65.4",18,82,null," "," "," "," "," "," "," "," "," "," "," ",0,0,0,0]
[null,null,null,null,null,null,null,null,null,null,null,null,null,null,"29.4","41.1","29.5",50,50,null," "," "," "," "," "," "," "," "," "," "," ",0,0,0,0]
[null,null,null,null,null,null,null,null,null,null,null,null,null,null,"20","28","52.1",28,73,null," "," "," "," "," "," "," "," "," "," "," ",0,0,0,0]
[null,null,null,null,null,null,null,null,null,null,null,null,null,null,"58.5","24.2","17.3",77,23,null," "," "," "," "," "," "," "," "," "," "," ",0,0,0,0]
[null,null,null,null,null,null,null,null,null,null,null,null,null,null,"34","38.5","27.5",55,45,null," "," "," "," "," "," "," "," "," "," "," ",0,0,0,0]
[null,null,null,null,null,null,null,null,null,null,null,null,null,null,"29.3","41.1","29.6",49,51,null," "," "," "," "," "," "," "," "," "," "," ",0,0,0,0]
[null,null,null,null,null,null,null,null,null,null,null,null,null,null,"25","35","40",39,61,null," "," "," "," "," "," "," "," "," "," "," ",0,0,0,0]
[null,null,null,null,null,null,null,null,null,null,null,null,null,null,"34.2","38.4","27.4",56,44,null," "," "," "," "," "," "," "," "," "," "," ",0,0,0,0]
[null,null,null,null,null,null,null,null,null,null,null,null,null,null,"38.8","35.7","25.5",60,40,null," "," "," "," "," "," "," "," "," "," "," ",0,0,0,0]
[null,null,null,null,null,null,null,null,null,null,null,null,null,null,"34.6","38.1","27.2",56,44,null," "," "," "," "," "," "," "," "," "," "," ",0,0,0,0]
[null,null,null,null,null,null,null,null,null,null,null,null,null,null,"69.1","18","12.9",84,16,null," "," "," "," "," "," "," "," "," "," "," ",0,0,0,0]
[null,null,null,null,null,null,null,null,null,null,null,null,null,null,"92.5","4.4","3.1",97,3,null," "," "," "," "," "," "," "," "," "," "," ",0,0,0,0]
[null,null,null,null,null,null,null,null,null,null,null,null,null,null,"48.9","29.8","21.3",70,30,null," "," "," "," "," "," "," "," "," "," "," ",0,0,0,0]
[null,null,null,null,null,null,null,null,null,null,null,null,null,null,"37.2","36.7","26.2",59,41,null," "," "," "," "," "," "," "," "," "," "," ",0,0,0,0]
[null,null,null,null,null,null,null,null,null,null,null,null,null,null,"31","40.2","28.7",52,48,null," "," "," "," "," "," "," "," "," "," "," ",0,0,0,0]
[null,null,null,null,null,null,null,null,null,null,null,null,null,null,"13.3","18.6","68.1",16,84,null," "," "," "," "," "," "," "," "," "," "," ",0,0,0,0]
[null,null,null,null,null,null,null,null,null,null,null,null,null,null,"52.9","27.5","19.6",73,27,null," "," "," "," "," "," "," "," "," "," "," ",0,0,0,0]
[null,null,null,null,null,null,null,null,null,null,null,null,null,null,"61.4","22.5","16.1",79,21,null," "," "," "," "," "," "," "," "," "," "," ",0,0,0,0]
[null,null,null,null,null,null,null,null,null,null,null,null,null,null,"10.1","14.1","75.8",12,88,null," "," "," "," "," "," "," "," "," "," "," ",0,0,0,0]
[null,null,null,null,null,null,null,null,null,null,null,null,null,null,"54.2","26.7","19.1",74,26,null," "," "," "," "," "," "," "," "," "," "," ",0,0,0,0]
[null,null,null,null,null,null,null,null,null,null,null,null,null,null,"52.4","27.8","19.8",72,28,null," "," "," "," "," "," "," "," "," "," "," ",0,0,0,0]
[null,null,null,null,null,null,null,null,null,null,null,null,null,null,null,null,null,null,null,null," "," "," "," "," "," "," "," "," "," "," ",0,0,0,0]
[null,null,null,null,null,null,null,null,null,null,null,null,null,null,null,null,null,null,null,null," "," "," "," "," "," "," "," "," "," "," ",0,0,0,0]
[null,null,null,null,null,null,null,null,null,null,null,null,null,null,"25.1","35.1","39.8",39,61,null," "," "," "," "," "," "," "," "," "," "," ",0,0,0,0]
[null,null,null,null,null,null,null,null,null,null,null,null,null,null,"74","15.2","10.9",87,13,null," "," "," "," "," "," "," "," "," "," "," ",0,0,0,0]
[null,null,null,null,null,null,null,null,null,null,null,null,null,null,"27.7","38.8","33.4",45,55,null," "," "," "," "," "," "," "," "," "," "," ",0,0,0,0]
[null,null,null,null,null,null,null,null,null,null,null,null,null,null,"26.6","37.2","36.2",42,58,null," "," "," "," "," "," "," "," "," "," "," ",0,0,0,0]
[null,null,null,null,null,null,null,null,null,null,null,null,null,null,"83.1","9.9","7",92,8,null," "," "," "," "," "," "," "," "," "," "," ",0,0,0,0]
[null,null,null,null,null,null,null,null,null,null,null,null,null,null,"40.8","34.5","24.7",62,38,null," "," "," "," "," "," "," "," "," "," "," ",0,0,0,0]
[null,null,null,null,null,null,null,null,null,null,null,null,null,null,"73.2","15.6","11.2",87,13,null," "," "," "," "," "," "," "," "," "," "," ",0,0,0,0]
[null,null,null,null,null,null,null,null,null,null,null,null,null,null,"47.8","30.5","21.8",69,31,null," "," "," "," "," "," "," "," "," "," "," ",0,0,0,0]
[null,null,null,null,null,null,null,null,null,null,null,null,null,null,"24.1","33.8","42",37,63,null," "," "," "," "," "," "," "," "," "," "," ",0,0,0,0]
[null,null,null,null,null,null,null,null,null,null,null,null,null,null,"59.2","23.8","17",78,22,null," "," "," "," "," "," "," "," "," "," "," ",0,0,0,0]
[null,null,null,null,null,null,null,null,null,null,null,null,null,null,"31.3","40.1","28.6",52,48,null," "," "," "," "," "," "," "," "," "," "," ",0,0,0,0]
[null,null,null,null,null,null,null,null,null,null,null,null,null,null,"35.8","37.5","26.8",57,43,null," "," "," "," "," "," "," "," "," "," "," ",0,0,0,0]
[null,null,null,null,null,null,null,null,null,null,null,null,null,null,"25.6","35.9","38.5",40,60,null," "," "," "," "," "," "," "," "," "," "," ",{"$f":"IF(H214=\"\",\"0\",IF(OR(AG214>=65,AH214>=55,AI214>=65),MAX(AG214:AI214),0))*1","v":0},0,0,0]
[null,null,null,null,null,null,null,null,null,null,null,null,null,null,"30.1","40.8","29.1",51,49,null,{"$f":"IF(H215=\"\",\" \",SEARCH(\"-\",H215))","v":" "},{"$f":"IF(H215=\"\",\" \",LEFT(H215,U215-1))","v":" "},{"$f":"IF(H215=\"\",\" \",MID(H215,U215+1,4))","v":" "},{"$f":"IF(H215=\"\",\" \",V215+W215)","v":" "},{"$f":"IF(H215=\"\",\" \",IF(X215>=4,\"OK\",\"NOT OK\"))","v":" "},{"$f":"IF(N215=\"\",\" \",SEARCH(\"-\",N215))","v":" "},{"$f":"IF(N215=\"\",\" \",LEFT(N215,Z215-1))","v":" "},{"$f":"IF(N215=\"\",\" \",MID(N215,Z215+1,4))","v":" "},{"$f":"IF(N215=\"\",\" \",AA215+AB215)","v":" "},{"$f":"IF(N215=\"\",\" \",IF(AC215>=2,\"OK\",\"NOT OK\"))","v":" "},{"$f":"IF(H215=\"\",\" \",IF(AND(Y215=\"OK\",AD215=\"OK\"),\"OYNA\",IF(Y215=AD215,\"OYNAMA\",IF(Y215=AD215,\"OYNA\",\"OYNAMA\"))))","v":" "},0,{"$f":"IF(H215=\"\",\"0\",SUBSTITUTE(I215,\".\",\",\"))*1","v":0},{"$f":"IF(H215=\"\",\"0\",SUBSTITUTE(J215,\".\",\",\"))*1","v":0},{"$f":"IF(H215=\"\",\"0\",SUBSTITUTE(K215,\".\",\",\"))*1","v":0}]
[null,null,null,null,null,null,null,null,null,null,null,null,null,null,"38.6","35.8","25.6",60,40,null," "," "," "," "," "," "," "," "," "," "," ",0,0,0,0]
[null,null,null,null,null,null,null,null,null,null,null,null,null,null,"42.6","33.5","23.9",64,36,null," "," "," "," "," "," "," "," "," "," "," ",0,0,0,0]
[null,null,null,null,null,null,null,null,null,null,null,null,null,null,"36.6","37","26.4",58,42,null," "," "," "," "," "," "," "," "," "," "," ",0,0,0,0]
[null,null,null,null,null,null,null,null,null,null,null,null,null,null,"12.6","17.7","69.7",15,85,null," "," "," "," "," "," "," "," "," "," "," ",0,0,0,0]
[null,null,null,null,null,null,null,null,null,null,null,null,null,null,"20.3","28.4","51.2",28,72,null," "," "," "," "," "," "," "," "," "," "," ",0,0,0,0]
[null,null,null,null,null,null,null,null,null,null,null,null,null,null,"22.3","31.3","46.4",33,67,null," "," "," "," "," "," "," "," "," "," "," ",0,0,0,0]
[null,null,null,null,null,null,null,null,null,null,null,null,null,null,"56.6","25.3","18.1",76,24,null," "," "," "," "," "," "," "," "," "," "," ",0,0,0,0]
[null,null,null,null,null,null,null,null,null,null,null,null,null,null,"5.4","7.5","87.1",6,94,null," "," "," "," "," "," "," "," "," "," "," ",0,0,0,0]
[null,null,null,null,null,null,null,null,null,null,null,null,null,null,"48.8","29.9","21.3",70,30,null," "," "," "," "," "," "," "," "," "," "," ",0,0,0,0]
[null,null,null,null,null,null,null,null,null,null,null,null,null,null,"64.9","20.5","14.6",82,18,null," "," "," "," "," "," "," "," "," "," "," ",0,0,0,0]
[null,null,null,null,null,null,null,null,null,null,null,null,null,null,"45.5","31.8","22.7",67,33,null," "," "," "," "," "," "," "," "," "," "," ",0,0,0,0]
[null,null,null,null,null,null,null,null,null,null,null,null,null,null,"51.8","28.1","20.1",72,28,null," "," "," "," "," "," "," "," "," "," "," ",0,0,0,0]
[null,null,null,null,null,null,null,null,null,null,null,null,null,null,"58.9","24","17.1",77,23,null," "," "," "," "," "," "," "," "," "," "," ",0,0,0,0]
[null,null,null,null,null,null,null,null,null,null,null,null,null,null,"37.8","36.3","25.9",59,41,null," "," "," "," "," "," "," "," "," "," "," ",0,0,0,0]
[null,null,null,null,null,null,null,null,null,null,null,null,null,null,"46.9","31","22.1",68,32,null," "," "," "," "," "," "," "," "," "," "," ",0,0,0,0]
[null,null,null,null,null,null,null,null,null,null,null,null,null,null,"27.4","38.4","34.2",45,55,null," "," "," "," "," "," "," "," "," "," "," ",0,0,0,0]
[null,null,null,null,null,null,null,null,null,null,null,null,null,null,"36.8","36.9","26.3",58,42,null," "," "," "," "," "," "," "," "," "," "," ",0,0,0,0]
[null,null,null,null,null,null,null,null,null,null,null,null,null,null,"64.6","20.6","14.7",81,19,null," "," "," "," "," "," "," "," "," "," "," ",0,0,0,0]
[null,null,null,null,null,null,null,null,null,null,null,null,null,null,"57.2","25","17.8",76,24,null," "," "," "," "," "," "," "," "," "," "," ",0,0,0,0]
[null,null,null,null,null,null,null,null,null,null,null,null,null,null,"0","0","100",0,100,null," "," "," "," "," "," "," "," "," "," "," ",0,0,0,0]
[null,null,null,null,null,null,null,null,null,null,null,null,null,null,"58","24.5","17.5",77,23,null," "," "," "," "," "," "," "," "," "," "," ",0,0,0,0]
[null,null,null,null,null,null,null,null,null,null,null,null,null,null,"21.6","30.2","48.2",31,69,null," "," "," "," "," "," "," "," "," "," "," ",0,0,0,0]
[null,null,null,null,null,null,null,null,null,null,null,null,null,null,"37.4","36.5","26.1",59,41,null," "," "," "," "," "," "," "," "," "," "," ",0,0,0,0]
[null,null,null,null,null,null,null,null,null,null,null,null,null,null,"52.7","27.6","19.7",73,27,null," "," "," "," "," "," "," "," "," "," "," ",0,0,0,0]
[null,null,null,null,null,null,null,null,null,null,null,null,null,null,"27.8","38.9","33.4",46,54,null," "," "," "," "," "," "," "," "," "," "," ",0,0,0,0]
[null,null,null,null,null,null,null,null,null,null,null,null,null,null,"21.9","30.7","47.3",32,68,null," "," "," "," "," "," "," "," "," "," "," ",0,0,0,0]
[null,null,null,null,null,null,null,null,null,null,null,null,null,null,"60.9","22.8","16.3",79,21,null," "," "," "," "," "," "," "," "," "," "," ",0,0,0,0]
[null,null,null,null,null,null,null,null,null,null,null,null,null,null,"27.5","38.5","34",44,56,null," "," "," "," "," "," "," "," "," "," "," ",0,0,0,0]
[null,null,null,null,null,null,null,null,null,null,null,null,null,null,"32","39.7","28.3",53,47,null," "," "," "," "," "," "," "," "," "," "," ",0,0,0,0]
[null,null,null,null,null,null,null,null,null,null,null,null,null,null,"42.2","33.7","24.1",64,36,null," "," "," "," "," "," "," "," "," "," "," ",0,0,0,0]
[null,null,null,null,null,null,null,null,null,null,null,null,null,null,"42.8","33.4","23.8",64,36,null," "," "," "," "," "," "," "," "," "," "," ",0,0,0,0]
[null,null,null,null,null,null,null,null,null,null,null,null,null,null,"41.6","34.1","24.3",63,37,null," "," "," "," "," "," "," "," "," "," "," ",0,0,0,0]
[null,null,null,null,null,null,null,null,null,null,null,null,null,null,"59","23.9","17.1",77,23,null," "," "," "," "," "," "," "," "," "," "," ",0,0,0,0]
[null,null,null,null,null,null,null,null,null,null,null,null,null,null,"14.3","20","65.7",18,82,null," "," "," "," "," "," "," "," "," "," "," ",0,0,0,0]
[null,null,null,null,null,null,null,null,null,null,null,null,null,null,"37.2","36.6","26.2",58,42,null," "," "," "," "," "," "," "," "," "," "," ",0,0,0,0]
[null,null,null,null,null,null,null,null,null,null,null,null,null,null,"29.4","41.1","29.5",50,50,null," "," "," "," "," "," "," "," "," "," "," ",0,0,0,0]
[null,null,null,null,null,null,null,null,null,null,null,null,null,null,"14.4","20.2","65.4",18,82,null," "," "," "," "," "," "," "," "," "," "," ",0,0,0,0]
[null,null,null,null,null,null,null,null,null,null,null,null,null,null,"58.5","24.2","17.3",77,23,null," "," "," "," "," "," "," "," "," "," "," ",0,0,0,0]
[null,null,null,null,null,null,null,null,null,null,null,null,null,null,"20","28","52.1",28,73,null," "," "," "," "," "," "," "," "," "," "," ",0,0,0,0]
[null,null,null,null,null,null,null,null,null,null,null,null,null,null,"34","38.5","27.5",55,45,null," "," "," "," "," "," "," "," "," "," "," ",0,0,0,0]
[null,null,null,null,null,null,null,null,null,null,null,null,null,null,"29.3","41.1","29.6",49,51,null," "," "," "," "," "," "," "," "," "," "," ",0,0,0,0]
[null,null,null,null,null,null,null,null,null,null,null,null,null,null,"25","35","40",39,61,null," "," "," "," "," "," "," "," "," "," "," ",0,0,0,0]
[null,null,null,null,null,null,null,null,null,null,null,null,null,null,"34.2","38.4","27.4",56,44,null," "," "," "," "," "," "," "," "," "," "," ",0,0,0,0]
[null,null,null,null,null,null,null,null,null,null,null,null,null,null,"82","10.5","7.5",91,9,null," "," "," "," "," "," "," "," "," "," "," ",0,0,0,0]
[null,null,null,null,null,null,null,null,null,null,null,null,null,null,"15.8","22.1","62.1",20,80,null," "," "," "," "," "," "," "," "," "," "," ",0,0,0,0]
[null,null,null,null,null,null,null,null,null,null,null,null,null,null,"40","35","25",61,39,null," "," "," "," "," "," "," "," "," "," "," ",0,0,0,0]
[null,null,null,null,null,null,null,null,null,null,null,null,null,null,"21.4","30","48.6",30,70,null," "," "," "," "," "," "," "," "," "," "," ",0,0,0,0]
[null,null,null,null,null,null,null,null,null,null,null,null,null,null,"40.3","34.8","24.9",62,38,null," "," "," "," "," "," "," "," "," "," "," ",0,0,0,0]
[null,null,null,null,null,null,null,null,null,null,null,null,null,null,"38.8","35.7","25.5",60,40,null," "," "," "," "," "," "," "," "," "," "," ",0,0,0,0]
[null,null,null,null,null,null,null,null,null,null,null,null,null,null,"27.1","38","34.9",44,56,null," "," "," "," "," "," "," "," "," "," "," ",0,0,0,0]
[null,null,null,null,null,null,null,null,null,null,null,null,null,null,"34.6","38.1","27.2",56,44,null," "," "," "," "," "," "," "," "," "," "," ",0,0,0,0]
[null,null,null,null,null,null,null,null,null,null,null,null,null,null,"92.5","4.4","3.1",97,3,null," "," "," "," "," "," "," "," "," "," "," ",0,0,0,0]
[null,null,null,null,null,null,null,null,null,null,null,null,null,null,"69.1","18","12.9",84,16,null," "," "," "," "," "," "," "," "," "," "," ",0,0,0,0]
[null,null,null,null,null,null,null,null,null,null,null,null,null,null,"48.9","29.8","21.3",70,30,null," "," "," "," "," "," "," "," "," "," "," ",0,0,0,0]
[null,null,null,null,null,null,null,null,null,null,null,null,null,null,"31","40.2","28.7",52,48,null," "," "," "," "," "," "," "," "," "," "," ",0,0,0,0]
[null,null,null,null,null,null,null,null,null,null,null,null,null,null,"37.2","36.7","26.2",59,41,null," "," "," "," "," "," "," "," "," "," "," ",0,0,0,0]
[null,null,null,null,null,null,null,null,null,null,null,null,null,null,"13.3","18.6","68.1",16,84,null," "," "," "," "," "," "," "," "," "," "," ",0,0,0,0]
[null,null,null,null,null,null,null,null,null,null,null,null,null,null,"52.9","27.5","19.6",73,27,null," "," "," "," "," "," "," "," "," "," "," ",0,0,0,0]
[null,null,null,null,null,null,null,null,null,null,null,null,null,null,"59.8","23.5","16.8",78,22,null," "," "," "," "," "," "," "," "," "," "," ",0,0,0,0]
[null,null,null,null,null,null,null,null,null,null,null,null,null,null,"27.9","39.1","33",46,54,null," "," "," "," "," "," "," "," "," "," "," ",0,0,0,0]
[null,null,null,null,null,null,null,null,null,null,null,null,null,null,"61.4","22.5","16.1",79,21,null," "," "," "," "," "," "," "," "," "," "," ",0,0,0,0]
[null,null,null,null,null,null,null,null,null,null,null,null,null,null,"10.1","14.1","75.8",12,88,null," "," "," "," "," "," "," "," "," "," "," ",0,0,0,0]
[null,null,null,null,null,null,null,null,null,null,null,null,null,null,"55.3","26.1","18.6",75,25,null," "," "," "," "," "," "," "," "," "," "," ",{"$f":"IF(H278=\"\",\"0\",IF(OR(AG278>=65,AH278>=55,AI278>=65),MAX(AG278:AI278),0))*1","v":0},0,0,0]
[null,null,null,null,null,null,null,null,null,null,null,null,null,null,"54.2","26.7","19.1",74,26,null,{"$f":"IF(H279=\"\",\" \",SEARCH(\"-\",H279))","v":" "},{"$f":"IF(H279=\"\",\" \",LEFT(H279,U279-1))","v":" "},{"$f":"IF(H279=\"\",\" \",MID(H279,U279+1,4))","v":" "},{"$f":"IF(H279=\"\",\" \",V279+W279)","v":" "},{"$f":"IF(H279=\"\",\" \",IF(X279>=4,\"OK\",\"NOT OK\"))","v":" "},{"$f":"IF(N279=\"\",\" \",SEARCH(\"-\",N279))","v":" "},{"$f":"IF(N279=\"\",\" \",LEFT(N279,Z279-1))","v":" "},{"$f":"IF(N279=\"\",\" \",MID(N279,Z279+1,4))","v":" "},{"$f":"IF(N279=\"\",\" \",AA279+AB279)","v":" "},{"$f":"IF(N279=\"\",\" \",IF(AC279>=2,\"OK\",\"NOT OK\"))","v":" "},{"$f":"IF(H279=\"\",\" \",IF(AND(Y279=\"OK\",AD279=\"OK\"),\"OYNA\",IF(Y279=AD279,\"OYNAMA\",IF(Y279=AD279,\"OYNA\",\"OYNAMA\"))))","v":" "},0,{"$f":"IF(H279=\"\",\"0\",SUBSTITUTE(I279,\".\",\",\"))*1","v":0},{"$f":"IF(H279=\"\",\"0\",SUBSTITUTE(J279,\".\",\",\"))*1","v":0},{"$f":"IF(H279=\"\",\"0\",SUBSTITUTE(K279,\".\",\",\"))*1","v":0}]
[null,null,null,null,null,null,null,null,null,null,null,null,null,null,"54.4","26.6","19",74,26,null," "," "," "," "," "," "," "," "," "," "," ",0,0,0,0]
[null,null,null,null,null,null,null,null,null,null,null,null,null,null,"24.8","34.8","40.4",38,62,null," "," "," "," "," "," "," "," "," "," "," ",0,0,0,0]
[null,null,null,null,null,null,null,null,null,null,null,null,null,null,"32.9","39.1","27.9",54,46,null," "," "," "," "," "," "," "," "," "," "," ",0,0,0,0]
[null,null,null,null,null,null,null,null,null,null,null,null,null,null,"52.4","27.8","19.8",72,28,null," "," "," "," "," "," "," "," "," "," "," ",0,0,0,0]
[null,null,null,null,null,null,null,null,null,null,null,null,null,null,null,null,null,null,null,null," "," "," "," "," "," "," "," "," "," "," ",0,0,0,0]
[null,null,null,null,null,null,null,null,null,null,null,null,null,null,null,null,null,null,null,null," "," "," "," "," "," "," "," "," "," "," ",0,0,0,0]
[null,null,null,null,null,null,null,null,null,null,null,null,null,null,null,null,null,null,null,null," "," "," "," "," "," "," "," "," "," "," ",0,0,0,0]
[null,null,null,null,null,null,null,null,null,null,null,null,null,null,null,null,null,null,null,null," "," "," "," "," "," "," "," "," "," "," ",0,0,0,0]
[null,null,null,null,null,null,null,null,null,null,null,null,null,null,null,null,null,null,null,null," "," "," "," "," "," "," "," "," "," "," ",0,0,0,0]
[null,null,null,null,null,null,null,null,null,null,null,null,null,null,null,null,null,null,null,null," "," "," "," "," "," "," "," "," "," "," ",0,0,0,0]
[null,null,null,null,null,null,null,null,null,null,null,null,null,null,null,null,null,null,null,null," "," "," "," "," "," "," "," "," "," "," ",0,0,0,0]
[null,null,null,null,null,null,null,null,null,null,null,null,null,null,null,null,null,null,null,null," "," "," "," "," "," "," "," "," "," "," ",0,0,0,0]
[null,null,null,null,null,null,null,null,null,null,null,null,null,null,null,null,null,null,null,null," "," "," "," "," "," "," "," "," "," "," ",0,0,0,0]
[null,null,null,null,null,null,null,null,null,null,null,null,null,null,null,null,null,null,null,null," "," "," "," "," "," "," "," "," "," "," ",0,0,0,0]
[null,null,null,null,null,null,null,null,null,null,null,null,null,null,null,null,null,null,null,null," "," "," "," "," "," "," "," "," "," "," ",0,0,0,0]
[null,null,null,null,null,null,null,null,null,null,null,null,null,null,null,null,null,null,null,null," "," "," "," "," "," "," "," "," "," "," ",0,0,0,0]
[null,null,null,null,null,null,null,null,null,null,null,null,null,null,null,null,null,null,null,null," "," "," "," "," "," "," "," "," "," "," ",0,0,0,0]
[null,null,null,null,null,null,null,null,null,null,null,null,null,null,null,null,null,null,null,null," "," "," "," "," "," "," "," "," "," "," ",0,0,0,0]
[null,null,null,null,null,null,null,null,null,null,null,null,null,null,null,null,null,null,null,null," "," "," "," "," "," "," "," "," "," "," ",0,0,0,0]
[null,null,null,null,null,null,null,null,null,null,null,null,null,null,null,null,null,null,null,null," "," "," "," "," "," "," "," "," "," "," ",0,0,0,0]
[null,null,null,null,null,null,null,null,null,null,null,null,null,null,null,null,null,null,null,null," "," "," "," "," "," "," "," "," "," "," ",0,0,0,0]
[null,null,null,null,null,null,null,null,null,null,null,null,null,null,null,null,null,null,null,null," "," "," "," "," "," "," "," "," "," "," ",0,0,0,0]
[null,null,null,null,null,null,null,null,null,null,null,null,null,null,null,null,null,null,null,null," "," "," "," "," "," "," "," "," "," "," ",0,0,0,0]
[null,null,null,null,null,null,null,null,null,null,null,null,null,null,null,null,null,null,null,null," "," "," "," "," "," "," "," "," "," "," ",0,0,0,0]
[null,null,null,null,null,null,null,null,null,null,null,null,null,null,null,null,null,null,null,null," "," "," "," "," "," "," "," "," "," "," ",0,0,0,0]
[null,null,null,null,null,null,null,null,null,null,null,null,null,null,null,null,null,null,null,null," "," "," "," "," "," "," "," "," "," "," ",0,0,0,0]
[null,null,null,null,null,null,null,null,null,null,null,null,null,null,null,null,null,null,null,null," "," "," "," "," "," "," "," "," "," "," ",0,0,0,0]
[null,null,null,null,null,null,null,null,null,null,null,null,null,null,null,null,null,null,null,null," "," "," "," "," "," "," "," "," "," "," ",0,0,0,0]
[null,null,null,null,null,null,null,null,null,null,null,null,null,null,null,null,null,null,null,null," "," "," "," "," "," "," "," "," "," "," ",0,0,0,0]
[null,null,null,null,null,null,null,null,null,null,null,null,null,null,null,null,null,null,null,null," "," "," "," "," "," "," "," "," "," "," ",0,0,0,0]
[null,null,null,null,null,null,null,null,null,null,null,null,null,null,null,null,null,null,null,null," "," "," "," "," "," "," "," "," "," "," ",0,0,0,0]
[null,null,null,null,null,null,null,null,null,null,null,null,null,null,null,null,null,null,null,null," "," "," "," "," "," "," "," "," "," "," ",0,0,0,0]
[null,null,null,null,null,null,null,null,null,null,null,null,null,null,null,null,null,null,null,null," "," "," "," "," "," "," "," "," "," "," ",0,0,0,0]
[null,null,null,null,null,null,null,null,null,null,null,null,null,null,null,null,null,null,null,null," "," "," "," "," "," "," "," "," "," "," ",0,0,0,0]
[null,null,null,null,null,null,null,null,null,null,null,null,null,null,null,null,null,null,null,null," "," "," "," "," "," "," "," "," "," "," ",0,0,0,0]
[null,null,null,null,null,null,null,null,null,null,null,null,null,null,null,null,null,null,null,null," "," "," "," "," "," "," "," "," "," "," ",0,0,0,0]
[null,null,null,null,null,null,null,null,null,null,null,null,null,null,null,null,null,null,null,null," "," "," "," "," "," "," "," "," "," "," ",0,0,0,0]
[null,null,null,null,null,null,null,null,null,null,null,null,null,null,null,null,null,null,null,null," "," "," "," "," "," "," "," "," "," "," ",0,0,0,0]
[null,null,null,null,null,null,null,null,null,null,null,null,null,null,null,null,null,null,null,null," "," "," "," "," "," "," "," "," "," "," ",0,0,0,0]
[null,null,null,null,null,null,null,null,null,null,null,null,null,null,null,null,null,null,null,null," "," "," "," "," "," "," "," "," "," "," ",0,0,0,0]
[null,null,null,null,null,null,null,null,null,null,null,null,null,null,null,null,null,null,null,null," "," "," "," "," "," "," "," "," "," "," ",0,0,0,0]
[null,null,null,null,null,null,null,null,null,null,null,null,null,null,null,null,null,null,null,null," "," "," "," "," "," "," "," "," "," "," ",0,0,0,0]
[null,null,null,null,null,null,null,null,null,null,null,null,null,null,null,null,null,null,null,null," "," "," "," "," "," "," "," "," "," "," ",0,0,0,0]
[null,null,null,null,null,null,null,null,null,null,null,null,null,null,null,null,null,null,null,null," "," "," "," "," "," "," "," "," "," "," ",0,0,0,0]
[null,null,null,null,null,null,null,null,null,null,null,null,null,null,null,null,null,null,null,null," "," "," "," "," "," "," "," "," "," "," ",0,0,0,0]
[null,null,null,null,null,null,null,null,null,null,null,null,null,null,null,null,null,null,null,null," "," "," "," "," "," "," "," "," "," "," ",0,0,0,0]
[null,null,null,null,null,null,null,null,null,null,null,null,null,null,null,null,null,null,null,null," "," "," "," "," "," "," "," "," "," "," ",0,0,0,0]
[null,null,null,null,null,null,null,null,null,null,null,null,null,null,null,null,null,null,null,null," "," "," "," "," "," "," "," "," "," "," ",0,0,0,0]
[null,null,null,null,null,null,null,null,null,null,null,null,null,null,null,null,null,null,null,null," "," "," "," "," "," "," "," "," "," "," ",0,0,0,0]
[null,null,null,null,null,null,null,null,null,null,null,null,null,null,null,null,null,null,null,null," "," "," "," "," "," "," "," "," "," "," ",0,0,0,0]
[null,null,null,null,null,null,null,null,null,null,null,null,null,null,null,null,null,null,null,null," "," "," "," "," "," "," "," "," "," "," ",0,0,0,0]
[null,null,null,null,null,null,null,null,null,null,null,null,null,null,null,null,null,null,null,null," "," "," "," "," "," "," "," "," "," "," ",0,0,0,0]
[null,null,null,null,null,null,null,null,null,null,null,null,null,null,null,null,null,null,null,null," "," "," "," "," "," "," "," "," "," "," ",0,0,0,0]
[null,null,null,null,null,null,null,null,null,null,null,null,null,null,null,null,null,null,null,null," "," "," "," "," "," "," "," "," "," "," ",0,0,0,0]
[null,null,null,null,null,null,null,null,null,null,null,null,null,null,null,null,null,null,null,null," "," "," "," "," "," "," "," "," "," "," ",0,0,0,0]
[null,null,null,null,null,null,null,null,null,null,null,null,null,null,null,null,null,null,null,null," "," "," "," "," "," "," "," "," "," "," ",0,0,0,0]
[null,null,null,null,null,null,null,null,null,null,null,null,null,null,null,null,null,null,null,null," "," "," "," "," "," "," "," "," "," "," ",0,0,0,0]
[null,null,null,null,null,null,null,null,null,null,null,null,null,null,null,null,null,null,null,null," "," "," "," "," "," "," "," "," "," "," ",0,0,0,0]
[null,null,null,null,null,null,null,null,null,null,null,null,null,null,null,null,null,null,null,null," "," "," "," "," "," "," "," "," "," "," ",0,0,0,0]
[null,null,null,null,null,null,null,null,null,null,null,null,null,null,null,null,null,null,null,null," "," "," "," "," "," "," "," "," "," "," ",0,0,0,0]
[null,null,null,null,null,null,null,null,null,null,null,null,null,null,null,null,null,null,null,null," "," "," "," "," "," "," "," "," "," "," ",0,0,0,0]
[null,null,null,null,null,null,null,null,null,null,null,null,null,null,null,null,null,null,null,null," "," "," "," "," "," "," "," "," "," "," ",0,0,0,0]
[null,null,null,null,null,null,null,null,null,null,null,null,null,null,null,null,null,null,null,null," "," "," "," "," "," "," "," "," "," "," ",{"$f":"IF(H342=\"\",\"0\",IF(OR(AG342>=65,AH342>=55,AI342>=65),MAX(AG342:AI342),0))*1","v":0},0,0,0]
[null,null,null,null,null,null,null,null,null,null,null,null,null,null,null,null,null,null,null,null,{"$f":"IF(H343=\"\",\" \",SEARCH(\"-\",H343))","v":" "},{"$f":"IF(H343=\"\",\" \",LEFT(H343,U343-1))","v":" "},{"$f":"IF(H343=\"\",\" \",MID(H343,U343+1,4))","v":" "},{"$f":"IF(H343=\"\",\" \",V343+W343)","v":" "},{"$f":"IF(H343=\"\",\" \",IF(X343>=4,\"OK\",\"NOT OK\"))","v":" "},{"$f":"IF(N343=\"\",\" \",SEARCH(\"-\",N343))","v":" "},{"$f":"IF(N343=\"\",\" \",LEFT(N343,Z343-1))","v":" "},{"$f":"IF(N343=\"\",\" \",MID(N343,Z343+1,4))","v":" "},{"$f":"IF(N343=\"\",\" \",AA343+AB343)","v":" "},{"$f":"IF(N343=\"\",\" \",IF(AC343>=2,\"OK\",\"NOT OK\"))","v":" "},{"$f":"IF(H343=\"\",\" \",IF(AND(Y343=\"OK\",AD343=\"OK\"),\"OYNA\",IF(Y343=AD343,\"OYNAMA\",IF(Y343=AD343,\"OYNA\",\"OYNAMA\"))))","v":" "},0,{"$f":"IF(H343=\"\",\"0\",SUBSTITUTE(I343,\".\",\",\"))*1","v":0},{"$f":"IF(H343=\"\",\"0\",SUBSTITUTE(J343,\".\",\",\"))*1","v":0},{"$f":"IF(H343=\"\",\"0\",SUBSTITUTE(K343,\".\",\",\"))*1","v":0}]
[null,null,null,null,null,null,null,null,null,null,null,null,null,null,null,null,null,null,null,null," "," "," "," "," "," "," "," "," "," "," ",0,0,0,0]
[null,null,null,null,null,null,null,null,null,null,null,null,null,null,null,null,null,null,null,null," "," "," "," "," "," "," "," "," "," "," ",0,0,0,0]
[null,null,null,null,null,null,null,null,null,null,null,null,null,null,null,null,null,null,null,null," "," "," "," "," "," "," "," "," "," "," ",0,0,0,0]
[null,null,null,null,null,null,null,null,null,null,null,null,null,null,null,null,null,null,null,null," "," "," "," "," "," "," "," "," "," "," ",0,0,0,0]
[null,null,null,null,null,null,null,null,null,null,null,null,null,null,null,null,null,null,null,null," "," "," "," "," "," "," "," "," "," "," ",0,0,0,0]
[null,null,null,null,null,null,null,null,null,null,null,null,null,null,null,null,null,null,null,null," "," "," "," "," "," "," "," "," "," "," ",0,0,0,0]
[null,null,null,null,null,null,null,null,null,null,null,null,null,null,null,null,null,null,null,null," "," "," "," "," "," "," "," "," "," "," ",0,0,0,0]
[null,null,null,null,null,null,null,null,null,null,null,null,null,null,null,null,null,null,null,null," "," "," "," "," "," "," "," "," "," "," ",0,0,0,0]
[null,null,null,null,null,null,null,null,null,null,null,null,null,null,null,null,null,null,null,null," "," "," "," "," "," "," "," "," "," "," ",0,0,0,0]
[null,null,null,null,null,null,null,null,null,null,null,null,null,null,null,null,null,null,null,null," "," "," "," "," "," "," "," "," "," "," ",0,0,0,0]
[null,null,null,null,null,null,null,null,null,null,null,null,null,null,null,null,null,null,null,null," "," "," "," "," "," "," "," "," "," "," ",0,0,0,0]
[null,null,null,null,null,null,null,null,null,null,null,null,null,null,null,null,null,null,null,null," "," "," "," "," "," "," "," "," "," "," ",0,0,0,0]
[null,null,null,null,null,null,null,null,null,null,null,null,null,null,null,null,null,null,null,null," "," "," "," "," "," "," "," "," "," "," ",0,0,0,0]
[null,null,null,null,null,null,null,null,null,null,null,null,null,null,null,null,null,null,null,null," "," "," "," "," "," "," "," "," "," "," ",0,0,0,0]
[null,null,null,null,null,null,null,null,null,null,null,null,null,null,null,null,null,null,null,null," "," "," "," "," "," "," "," "," "," "," ",0,0,0,0]
[null,null,null,null,null,null,null,null,null,null,null,null,null,null,null,null,null,null,null,null," "," "," "," "," "," "," "," "," "," "," ",0,0,0,0]
[null,null,null,null,null,null,null,null,null,null,null,null,null,null,null,null,null,null,null,null," "," "," "," "," "," "," "," "," "," "," ",0,0,0,0]
[null,null,null,null,null,null,null,null,null,null,null,null,null,null,null,null,null,null,null,null," "," "," "," "," "," "," "," "," "," "," ",0,0,0,0]
[null,null,null,null,null,null,null,null,null,null,null,null,null,null,null,null,null,null,null,null," "," "," "," "," "," "," "," "," "," "," ",0,0,0,0]
[null,null,null,null,null,null,null,null,null,null,null,null,null,null,null,null,null,null,null,null," "," "," "," "," "," "," "," "," "," "," ",0,0,0,0]
[null,null,null,null,null,null,null,null,null,null,null,null,null,null,null,null,null,null,null,null," "," "," "," "," "," "," "," "," "," "," ",0,0,0,0]
[null,null,null,null,null,null,null,null,null,null,null,null,null,null,null,null,null,null,null,null," "," "," "," "," "," "," "," "," "," "," ",0,0,0,0]
[null,null,null,null,null,null,null,null,null,null,null,null,null,null,null,null,null,null,null,null," "," "," "," "," "," "," "," "," "," "," ",0,0,0,0]
[null,null,null,null,null,null,null,null,null,null,null,null,null,null,null,null,null,null,null,null," "," "," "," "," "," "," "," "," "," "," ",0,0,0,0]
[null,null,null,null,null,null,null,null,null,null,null,null,null,null,null,null,null,null,null,null," "," "," "," "," "," "," "," "," "," "," ",0,0,0,0]
[null,null,null,null,null,null,null,null,null,null,null,null,null,null,null,null,null,null,null,null," "," "," "," "," "," "," "," "," "," "," ",0,0,0,0]
[null,null,null,null,null,null,null,null,null,null,null,null,null,null,null,null,null,null,null,null," "," "," "," "," "," "," "," "," "," "," ",0,0,0,0]
[null,null,null,null,null,null,null,null,null,null,null,null,null,null,null,null,null,null,null,null," "," "," "," "," "," "," "," "," "," "," ",0,0,0,0]
[null,null,null,null,null,null,null,null,null,null,null,null,null,null,null,null,null,null,null,null," "," "," "," "," "," "," "," "," "," "," ",0,0,0,0]
[null,null,null,null,null,null,null,null,null,null,null,null,null,null,null,null,null,null,null,null," "," "," "," "," "," "," "," "," "," "," ",0,0,0,0]
[null,null,null,null,null,null,null,null,null,null,null,null,null,null,null,null,null,null,null,null," "," "," "," "," "," "," "," "," "," "," ",0,0,0,0]
[null,null,null,null,null,null,null,null,null,null,null,null,null,null,null,null,null,null,null,null," "," "," "," "," "," "," "," "," "," "," ",0,0,0,0]
[null,null,null,null,null,null,null,null,null,null,null,null,null,null,null,null,null,null,null,null," "," "," "," "," "," "," "," "," "," "," ",0,0,0,0]
[null,null,null,null,null,null,null,null,null,null,null,null,null,null,null,null,null,null,null,null," "," "," "," "," "," "," "," "," "," "," ",0,0,0,0]
[null,null,null,null,null,null,null,null,null,null,null,null,null,null,null,null,null,null,null,null," "," "," "," "," "," "," "," "," "," "," ",0,0,0,0]
[null,null,null,null,null,null,null,null,null,null,null,null,null,null,null,null,null,null,null,null," "," "," "," "," "," "," "," "," "," "," ",0,0,0,0]
[null,null,null,null,null,null,null,null,null,null,null,null,null,null,null,null,null,null,null,null," "," "," "," "," "," "," "," "," "," "," ",0,0,0,0]
[null,null,null,null,null,null,null,null,null,null,null,null,null,null,null,null,null,null,null,null," "," "," "," "," "," "," "," "," "," "," ",0,0,0,0]
[null,null,null,null,null,null,null,null,null,null,null,null,null,null,null,null,null,null,null,null," "," "," "," "," "," "," "," "," "," "," ",0,0,0,0]
[null,null,null,null,null,null,null,null,null,null,null,null,null,null,null,null,null,null,null,null," "," "," "," "," "," "," "," "," "," "," ",0,0,0,0]
[null,null,null,null,null,null,null,null,null,null,null,null,null,null,null,null,null,null,null,null," "," "," "," "," "," "," "," "," "," "," ",0,0,0,0]
[null,null,null,null,null,null,null,null,null,null,null,null,null,null,null,null,null,null,null,null," "," "," "," "," "," "," "," "," "," "," ",0,0,0,0]
[null,null,null,null,null,null,null,null,null,null,null,null,null,null,null,null,null,null,null,null," "," "," "," "," "," "," "," "," "," "," ",0,0,0,0]
[null,null,null,null,null,null,null,null,null,null,null,null,null,null,null,null,null,null,null,null," "," "," "," "," "," "," "," "," "," "," ",0,0,0,0]
[null,null,null,null,null,null,null,null,null,null,null,null,null,null,null,null,null,null,null,null," "," "," "," "," "," "," "," "," "," "," ",0,0,0,0]
[null,null,null,null,null,null,null,null,null,null,null,null,null,null,null,null,null,null,null,null," "," "," "," "," "," "," "," "," "," "," ",0,0,0,0]
[null,null,null,null,null,null,null,null,null,null,null,null,null,null,null,null,null,null,null,null," "," "," "," "," "," "," "," "," "," "," ",0,0,0,0]
[null,null,null,null,null,null,null,null,null,null,null,null,null,null,null,null,null,null,null,null," "," "," "," "," "," "," "," "," "," "," ",0,0,0,0]
[null,null,null,null,null,null,null,null,null,null,null,null,null,null,null,null,null,null,null,null," "," "," "," "," "," "," "," "," "," "," ",0,0,0,0]
[null,null,null,null,null,null,null,null,null,null,null,null,null,null,null,null,null,null,null,null," "," "," "," "," "," "," "," "," "," "," ",0,0,0,0]
[null,null,null,null,null,null,null,null,null,null,null,null,null,null,null,null,null,null,null,null," "," "," "," "," "," "," "," "," "," "," ",0,0,0,0]
[null,null,null,null,null,null,null,null,null,null,null,null,null,null,null,null,null,null,null,null," "," "," "," "," "," "," "," "," "," "," ",0,0,0,0]
[null,null,null,null,null,null,null,null,null,null,null,null,null,null,null,null,null,null,null,null," "," "," "," "," "," "," "," "," "," "," ",0,0,0,0]
[null,null,null,null,null,null,null,null,null,null,null,null,null,null,null,null,null,null,null,null," "," "," "," "," "," "," "," "," "," "," ",0,0,0,0]
[null,null,null,null,null,null,null,null,null,null,null,null,null,null,null,null,null,null,null,null," "," "," "," "," "," "," "," "," "," "," ",0,0,0,0]
[null,null,null,null,null,null,null,null,null,null,null,null,null,null,null,null,null,null,null,null," "," "," "," "," "," "," "," "," "," "," ",0,0,0,0]
[null,null,null,null,null,null,null,null,null,null,null,null,null,null,null,null,null,null,null,null," "," "," "," "," "," "," "," "," "," "," ",0,0,0,0]
[null,null,null,null,null,null,null,null,null,null,null,null,null,null,null,null,null,null,null,null," "," "," "," "," "," "," "," "," "," "," ",0,0,0,0]
[null,null,null,null,null,null,null,null,null,null,null,null,null,null,null,null,null,null,null,null," "," "," "," "," "," "," "," "," "," "," ",0,0,0,0]
[null,null,null,null,null,null,null,null,null,null,null,null,null,null,null,null,null,null,null,null," "," "," "," "," "," "," "," "," "," "," ",0,0,0,0]
[null,null,null,null,null,null,null,null,null,null,null,null,null,null,null,null,null,null,null,null," "," "," "," "," "," "," "," "," "," "," ",0,0,0,0]
[null,null,null,null,null,null,null,null,null,null,null,null,null,null,null,null,null,null,null,null," "," "," "," "," "," "," "," "," "," "," ",0,0,0,0]
[null,null,null,null,null,null,null,null,null,null,null,null,null,null,null,null,null,null,null,null," "," "," "," "," "," "," "," "," "," "," ",{"$f":"IF(H406=\"\",\"0\",IF(OR(AG406>=65,AH406>=55,AI406>=65),MAX(AG406:AI406),0))*1","v":0},0,0,0]
[null,null,null,null,null,null,null,null,null,null,null,null,null,null,null,null,null,null,null,null,{"$f":"IF(H407=\"\",\" \",SEARCH(\"-\",H407))","v":" "},{"$f":"IF(H407=\"\",\" \",LEFT(H407,U407-1))","v":" "},{"$f":"IF(H407=\"\",\" \",MID(H407,U407+1,4))","v":" "},{"$f":"IF(H407=\"\",\" \",V407+W407)","v":" "},{"$f":"IF(H407=\"\",\" \",IF(X407>=4,\"OK\",\"NOT OK\"))","v":" "},{"$f":"IF(N407=\"\",\" \",SEARCH(\"-\",N407))","v":" "},{"$f":"IF(N407=\"\",\" \",LEFT(N407,Z407-1))","v":" "},{"$f":"IF(N407=\"\",\" \",MID(N407,Z407+1,4))","v":" "},{"$f":"IF(N407=\"\",\" \",AA407+AB407)","v":" "},{"$f":"IF(N407=\"\",\" \",IF(AC407>=2,\"OK\",\"NOT OK\"))","v":" "},{"$f":"IF(H407=\"\",\" \",IF(AND(Y407=\"OK\",AD407=\"OK\"),\"OYNA\",IF(Y407=AD407,\"OYNAMA\",IF(Y407=AD407,\"OYNA\",\"OYNAMA\"))))","v":" "},0,{"$f":"IF(H407=\"\",\"0\",SUBSTITUTE(I407,\".\",\",\"))*1","v":0},{"$f":"IF(H407=\"\",\"0\",SUBSTITUTE(J407,\".\",\",\"))*1","v":0},{"$f":"IF(H407=\"\",\"0\",SUBSTITUTE(K407,\".\",\",\"))*1","v":0}]
[null,null,null,null,null,null,null,null,null,null,null,null,null,null,null,null,null,null,null,null," "," "," "," "," "," "," "," "," "," "," ",0,0,0,0]
[null,null,null,null,null,null,null,null,null,null,null,null,null,null,null,null,null,null,null,null," "," "," "," "," "," "," "," "," "," "," ",0,0,0,0]
[null,null,null,null,null,null,null,null,null,null,null,null,null,null,null,null,null,null,null,null," "," "," "," "," "," "," "," "," "," "," ",0,0,0,0]
[null,null,null,null,null,null,null,null,null,null,null,null,null,null,null,null,null,null,null,null," "," "," "," "," "," "," "," "," "," "," ",0,0,0,0]
[null,null,null,null,null,null,null,null,null,null,null,null,null,null,null,null,null,null,null,null," "," "," "," "," "," "," "," "," "," "," ",0,0,0,0]
[null,null,null,null,null,null,null,null,null,null,null,null,null,null,null,null,null,null,null,null," "," "," "," "," "," "," "," "," "," "," ",0,0,0,0]
[null,null,null,null,null,null,null,null,null,null,null,null,null,null,null,null,null,null,null,null," "," "," "," "," "," "," "," "," "," "," ",0,0,0,0]
[null,null,null,null,null,null,null,null,null,null,null,null,null,null,null,null,null,null,null,null," "," "," "," "," "," "," "," "," "," "," ",0,0,0,0]
[null,null,null,null,null,null,null,null,null,null,null,null,null,null,null,null,null,null,null,null," "," "," "," "," "," "," "," "," "," "," ",0,0,0,0]
[null,null,null,null,null,null,null,null,null,null,null,null,null,null,null,null,null,null,null,null," "," "," "," "," "," "," "," "," "," "," ",0,0,0,0]
[null,null,null,null,null,null,null,null,null,null,null,null,null,null,null,null,null,null,null,null," "," "," "," "," "," "," "," "," "," "," ",0,0,0,0]
[null,null,null,null,null,null,null,null,null,null,null,null,null,null,null,null,null,null,null,null," "," "," "," "," "," "," "," "," "," "," ",0,0,0,0]
[null,null,null,null,null,null,null,null,null,null,null,null,null,null,null,null,null,null,null,null," "," "," "," "," "," "," "," "," "," "," ",0,0,0,0]
[null,null,null,null,null,null,null,null,null,null,null,null,null,null,null,null,null,null,null,null," "," "," "," "," "," "," "," "," "," "," ",0,0,0,0]
[null,null,null,null,null,null,null,null,null,null,null,null,null,null,null,null,null,null,null,null," "," "," "," "," "," "," "," "," "," "," ",0,0,0,0]
[null,null,null,null,null,null,null,null,null,null,null,null,null,null,null,null,null,null,null,null," "," "," "," "," "," "," "," "," "," "," ",0,0,0,0]
[null,null,null,null,null,null,null,null,null,null,null,null,null,null,null,null,null,null,null,null," "," "," "," "," "," "," "," "," "," "," ",0,0,0,0]
[null,null,null,null,null,null,null,null,null,null,null,null,null,null,null,null,null,null,null,null," "," "," "," "," "," "," "," "," "," "," ",0,0,0,0]
[null,null,null,null,null,null,null,null,null,null,null,null,null,null,null,null,null,null,null,null," "," "," "," "," "," "," "," "," "," "," ",0,0,0,0]
[null,null,null,null,null,null,null,null,null,null,null,null,null,null,null,null,null,null,null,null," "," "," "," "," "," "," "," "," "," "," ",0,0,0,0]
[null,null,null,null,null,null,null,null,null,null,null,null,null,null,null,null,null,null,null,null," "," "," "," "," "," "," "," "," "," "," ",0,0,0,0]
[null,null,null,null,null,null,null,null,null,null,null,null,null,null,null,null,null,null,null,null," "," "," "," "," "," "," "," "," "," "," ",0,0,0,0]
[null,null,null,null,null,null,null,null,null,null,null,null,null,null,null,null,null,null,null,null," "," "," "," "," "," "," "," "," "," "," ",0,0,0,0]
[null,null,null,null,null,null,null,null,null,null,null,null,null,null,null,null,null,null,null,null," "," "," "," "," "," "," "," "," "," "," ",0,0,0,0]
[null,null,null,null,null,null,null,null,null,null,null,null,null,null,null,null,null,null,null,null," "," "," "," "," "," "," "," "," "," "," ",0,0,0,0]
[null,null,null,null,null,null,null,null,null,null,null,null,null,null,null,null,null,null,null,null," "," "," "," "," "," "," "," "," "," "," ",0,0,0,0]
[null,null,null,null,null,null,null,null,null,null,null,null,null,null,null,null,null,null,null,null," "," "," "," "," "," "," "," "," "," "," ",0,0,0,0]
[null,null,null,null,null,null,null,null,null,null,null,null,null,null,null,null,null,null,null,null," "," "," "," "," "," "," "," "," "," "," ",0,0,0,0]
[null,null,null,null,null,null,null,null,null,null,null,null,null,null,null,null,null,null,null,null," "," "," "," "," "," "," "," "," "," "," ",0,0,0,0]
[null,null,null,null,null,null,null,null,null,null,null,null,null,null,null,null,null,null,null,null," "," "," "," "," "," "," "," "," "," "," ",0,0,0,0]
[null,null,null,null,null,null,null,null,null,null,null,null,null,null,null,null,null,null,null,null," "," "," "," "," "," "," "," "," "," "," ",0,0,0,0]
[null,null,null,null,null,null,null,null,null,null,null,null,null,null,null,null,null,null,null,null," "," "," "," "," "," "," "," "," "," "," ",0,0,0,0]
[null,null,null,null,null,null,null,null,null,null,null,null,null,null,null,null,null,null,null,null," "," "," "," "," "," "," "," "," "," "," ",0,0,0,0]
[null,null,null,null,null,null,null,null,null,null,null,null,null,null,null,null,null,null,null,null," "," "," "," "," "," "," "," "," "," "," ",0,0,0,0]
[null,null,null,null,null,null,null,null,null,null,null,null,null,null,null,null,null,null,null,null," "," "," "," "," "," "," "," "," "," "," ",0,0,0,0]
[null,null,null,null,null,null,null,null,null,null,null,null,null,null,null,null,null,null,null,null," "," "," "," "," "," "," "," "," "," "," ",0,0,0,0]
[null,null,null,null,null,null,null,null,null,null,null,null,null,null,null,null,null,null,null,null," "," "," "," "," "," "," "," "," "," "," ",0,0,0,0]
[null,null,null,null,null,null,null,null,null,null,null,null,null,null,null,null,null,null,null,null," "," "," "," "," "," "," "," "," "," "," ",0,0,0,0]
[null,null,null,null,null,null,null,null,null,null,null,null,null,null,null,null,null,null,null,null," "," "," "," "," "," "," "," "," "," "," ",0,0,0,0]
[null,null,null,null,null,null,null,null,null,null,null,null,null,null,null,null,null,null,null,null," "," "," "," "," "," "," "," "," "," "," ",0,0,0,0]
[null,null,null,null,null,null,null,null,null,null,null,null,null,null,null,null,null,null,null,null," "," "," "," "," "," "," "," "," "," "," ",0,0,0,0]
[null,null,null,null,null,null,null,null,null,null,null,null,null,null,null,null,null,null,null,null," "," "," "," "," "," "," "," "," "," "," ",0,0,0,0]
[null,null,null,null,null,null,null,null,null,null,null,null,null,null,null,null,null,null,null,null," "," "," "," "," "," "," "," "," "," "," ",0,0,0,0]
[null,null,null,null,null,null,null,null,null,null,null,null,null,null,null,null,null,null,null,null," "," "," "," "," "," "," "," "," "," "," ",0,0,0,0]
[null,null,null,null,null,null,null,null,null,null,null,null,null,null,null,null,null,null,null,null," "," "," "," "," "," "," "," "," "," "," ",0,0,0,0]
[null,null,null,null,null,null,null,null,null,null,null,null,null,null,null,null,null,null,null,null," "," "," "," "," "," "," "," "," "," "," ",0,0,0,0]
[null,null,null,null,null,null,null,null,null,null,null,null,null,null,null,null,null,null,null,null," "," "," "," "," "," "," "," "," "," "," ",0,0,0,0]
[null,null,null,null,null,null,null,null,null,null,null,null,null,null,null,null,null,null,null,null," "," "," "," "," "," "," "," "," "," "," ",0,0,0,0]
[null,null,null,null,null,null,null,null,null,null,null,null,null,null,null,null,null,null,null,null," "," "," "," "," "," "," "," "," "," "," ",0,0,0,0]
[null,null,null,null,null,null,null,null,null,null,null,null,null,null,null,null,null,null,null,null," "," "," "," "," "," "," "," "," "," "," ",0,0,0,0]
[null,null,null,null,null,null,null,null,null,null,null,null,null,null,null,null,null,null,null,null," "," "," "," "," "," "," "," "," "," "," ",0,0,0,0]
[null,null,null,null,null,null,null,null,null,null,null,null,null,null,null,null,null,null,null,null," "," "," "," "," "," "," "," "," "," "," ",0,0,0,0]
[null,null,null,null,null,null,null,null,null,null,null,null,null,null,null,null,null,null,null,null," "," "," "," "," "," "," "," "," "," "," ",0,0,0,0]
[null,null,null,null,null,null,null,null,null,null,null,null,null,null,null,null,null,null,null,null," "," "," "," "," "," "," "," "," "," "," ",0,0,0,0]
[null,null,null,null,null,null,null,null,null,null,null,null,null,null,null,null,null,null,null,null," "," "," "," "," "," "," "," "," "," "," ",0,0,0,0]
[null,null,null,null,null,null,null,null,null,null,null,null,null,null,null,null,null,null,null,null," "," "," "," "," "," "," "," "," "," "," ",0,0,0,0]
[null,null,null,null,null,null,null,null,null,null,null,null,null,null,null,null,null,null,null,null," "," "," "," "," "," "," "," "," "," "," ",0,0,0,0]
[null,null,null,null,null,null,null,null,null,null,null,null,null,null,null,null,null,null,null,null," "," "," "," "," "," "," "," "," "," "," ",0,0,0,0]
[null,null,null,null,null,null,null,null,null,null,null,null,null,null,null,null,null,null,null,null," "," "," "," "," "," "," "," "," "," "," ",0,0,0,0]
[null,null,null,null,null,null,null,null,null,null,null,null,null,null,null,null,null,null,null,null," "," "," "," "," "," "," "," "," "," "," ",0,0,0,0]
[null,null,null,null,null,null,null,null,null,null,null,null,null,null,null,null,null,null,null,null," "," "," "," "," "," "," "," "," "," "," ",0,0,0,0]
[null,null,null,null,null,null,null,null,null,null,null,null,null,null,null,null,null,null,null,null," "," "," "," "," "," "," "," "," "," "," ",0,0,0,0]
[null,null,null,null,null,null,null,null,null,null,null,null,null,null,null,null,null,null,null,null," "," "," "," "," "," "," "," "," "," "," ",{"$f":"IF(H470=\"\",\"0\",IF(OR(AG470>=65,AH470>=55,AI470>=65),MAX(AG470:AI470),0))*1","v":0},0,0,0]
[null,null,null,null,null,null,null,null,null,null,null,null,null,null,null,null,null,null,null,null,{"$f":"IF(H471=\"\",\" \",SEARCH(\"-\",H471))","v":" "},{"$f":"IF(H471=\"\",\" \",LEFT(H471,U471-1))","v":" "},{"$f":"IF(H471=\"\",\" \",MID(H471,U471+1,4))","v":" "},{"$f":"IF(H471=\"\",\" \",V471+W471)","v":" "},{"$f":"IF(H471=\"\",\" \",IF(X471>=4,\"OK\",\"NOT OK\"))","v":" "},{"$f":"IF(N471=\"\",\" \",SEARCH(\"-\",N471))","v":" "},{"$f":"IF(N471=\"\",\" \",LEFT(N471,Z471-1))","v":" "},{"$f":"IF(N471=\"\",\" \",MID(N471,Z471+1,4))","v":" "},{"$f":"IF(N471=\"\",\" \",AA471+AB471)","v":" "},{"$f":"IF(N471=\"\",\" \",IF(AC471>=2,\"OK\",\"NOT OK\"))","v":" "},{"$f":"IF(H471=\"\",\" \",IF(AND(Y471=\"OK\",AD471=\"OK\"),\"OYNA\",IF(Y471=AD471,\"OYNAMA\",IF(Y471=AD471,\"OYNA\",\"OYNAMA\"))))","v":" "},0,{"$f":"IF(H471=\"\",\"0\",SUBSTITUTE(I471,\".\",\",\"))*1","v":0},{"$f":"IF(H471=\"\",\"0\",SUBSTITUTE(J471,\".\",\",\"))*1","v":0},{"$f":"IF(H471=\"\",\"0\",SUBSTITUTE(K471,\".\",\",\"))*1","v":0}]
[null,null,null,null,null,null,null,null,null,null,null,null,null,null,null,null,null,null,null,null," "," "," "," "," "," "," "," "," "," "," ",0,0,0,0]
[null,null,null,null,null,null,null,null,null,null,null,null,null,null,null,null,null,null,null,null," "," "," "," "," "," "," "," "," "," "," ",0,0,0,0]
[null,null,null,null,null,null,null,null,null,null,null,null,null,null,null,null,null,null,null,null," "," "," "," "," "," "," "," "," "," "," ",0,0,0,0]
[null,null,null,null,null,null,null,null,null,null,null,null,null,null,null,null,null,null,null,null," "," "," "," "," "," "," "," "," "," "," ",0,0,0,0]
[null,null,null,null,null,null,null,null,null,null,null,null,null,null,null,null,null,null,null,null," "," "," "," "," "," "," "," "," "," "," ",0,0,0,0]
[null,null,null,null,null,null,null,null,null,null,null,null,null,null,null,null,null,null,null,null," "," "," "," "," "," "," "," "," "," "," ",0,0,0,0]
[null,null,null,null,null,null,null,null,null,null,null,null,null,null,null,null,null,null,null,null," "," "," "," "," "," "," "," "," "," "," ",0,0,0,0]
[null,null,null,null,null,null,null,null,null,null,null,null,null,null,null,null,null,null,null,null," "," "," "," "," "," "," "," "," "," "," ",0,0,0,0]
[null,null,null,null,null,null,null,null,null,null,null,null,null,null,null,null,null,null,null,null," "," "," "," "," "," "," "," "," "," "," ",0,0,0,0]
[null,null,null,null,null,null,null,null,null,null,null,null,null,null,null,null,null,null,null,null," "," "," "," "," "," "," "," "," "," "," ",0,0,0,0]
[null,null,null,null,null,null,null,null,null,null,null,null,null,null,null,null,null,null,null,null," "," "," "," "," "," "," "," "," "," "," ",0,0,0,0]
[null,null,null,null,null,null,null,null,null,null,null,null,null,null,null,null,null,null,null,null," "," "," "," "," "," "," "," "," "," "," ",0,0,0,0]
[null,null,null,null,null,null,null,null,null,null,null,null,null,null,null,null,null,null,null,null," "," "," "," "," "," "," "," "," "," "," ",0,0,0,0]
[null,null,null,null,null,null,null,null,null,null,null,null,null,null,null,null,null,null,null,null," "," "," "," "," "," "," "," "," "," "," ",0,0,0,0]
[null,null,null,null,null,null,null,null,null,null,null,null,null,null,null,null,null,null,null,null," "," "," "," "," "," "," "," "," "," "," ",0,0,0,0]
[null,null,null,null,null,null,null,null,null,null,null,null,null,null,null,null,null,null,null,null," "," "," "," "," "," "," "," "," "," "," ",0,0,0,0]
[null,null,null,null,null,null,null,null,null,null,null,null,null,null,null,null,null,null,null,null," "," "," "," "," "," "," "," "," "," "," ",0,0,0,0]
[null,null,null,null,null,null,null,null,null,null,null,null,null,null,null,null,null,null,null,null," "," "," "," "," "," "," "," "," "," "," ",0,0,0,0]
[null,null,null,null,null,null,null,null,null,null,null,null,null,null,null,null,null,null,null,null," "," "," "," "," "," "," "," "," "," "," ",0,0,0,0]
[null,null,null,null,null,null,null,null,null,null,null,null,null,null,null,null,null,null,null,null," "," "," "," "," "," "," "," "," "," "," ",0,0,0,0]
[null,null,null,null,null,null,null,null,null,null,null,null,null,null,null,null,null,null,null,null," "," "," "," "," "," "," "," "," "," "," ",0,0,0,0]
[null,null,null,null,null,null,null,null,null,null,null,null,null,null,null,null,null,null,null,null," "," "," "," "," "," "," "," "," "," "," ",0,0,0,0]
[null,null,null,null,null,null,null,null,null,null,null,null,null,null,null,null,null,null,null,null," "," "," "," "," "," "," "," "," "," "," ",0,0,0,0]
[null,null,null,null,null,null,null,null,null,null,null,null,null,null,null,null,null,null,null,null," "," "," "," "," "," "," "," "," "," "," ",0,0,0,0]
[null,null,null,null,null,null,null,null,null,null,null,null,null,null,null,null,null,null,null,null," "," "," "," "," "," "," "," "," "," "," ",0,0,0,0]
[null,null,null,null,null,null,null,null,null,null,null,null,null,null,null,null,null,null,null,null," "," "," "," "," "," "," "," "," "," "," ",0,0,0,0]
[null,null,null,null,null,null,null,null,null,null,null,null,null,null,null,null,null,null,null,null," "," "," "," "," "," "," "," "," "," "," ",0,0,0,0]
[null,null,null,null,null,null,null,null,null,null,null,null,null,null,null,null,null,null,null,null," "," "," "," "," "," "," "," "," "," "," ",0,0,0,0]
[null,null,null,null,null,null,null,null,null,null,null,null,null,null,null,null,null,null,null,null," "," "," "," "," "," "," "," "," "," "," ",0,0,0,0]
[null,null,null,null,null,null,null,null,null,null,null,null,null,null,null,null,null,null,null,null," "," "," "," "," "," "," "," "," "," "," ",0,0,0,0]
[null,null,null,null,null,null,null,null,null,null,null,null,null,null,null,null,null,null,null,null," "," "," "," "," "," "," "," "," "," "," ",0,0,0,0]
[null,null,null,null,null,null,null,null,null,null,null,null,null,null,null,null,null,null,null,null," "," "," "," "," "," "," "," "," "," "," ",0,0,0,0]
[null,null,null,null,null,null,null,null,null,null,null,null,null,null,null,null,null,null,null,null," "," "," "," "," "," "," "," "," "," "," ",0,0,0,0]
[null,null,null,null,null,null,null,null,null,null,null,null,null,null,null,null,null,null,null,null," "," "," "," "," "," "," "," "," "," "," ",0,0,0,0]
[null,null,null,null,null,null,null,null,null,null,null,null,null,null,null,null,null,null,null,null," "," "," "," "," "," "," "," "," "," "," ",0,0,0,0]
[null,null,null,null,null,null,null,null,null,null,null,null,null,null,null,null,null,null,null,null," "," "," "," "," "," "," "," "," "," "," ",0,0,0,0]
[null,null,null,null,null,null,null,null,null,null,null,null,null,null,null,null,null,null,null,null," "," "," "," "," "," "," "," "," "," "," ",0,0,0,0]
[null,null,null,null,null,null,null,null,null,null,null,null,null,null,null,null,null,null,null,null," "," "," "," "," "," "," "," "," "," "," ",0,0,0,0]
[null,null,null,null,null,null,null,null,null,null,null,null,null,null,null,null,null,null,null,null," "," "," "," "," "," "," "," "," "," "," ",0,0,0,0]
[null,null,null,null,null,null,null,null,null,null,null,null,null,null,null,null,null,null,null,null," "," "," "," "," "," "," "," "," "," "," ",0,0,0,0]
[null,null,null,null,null,null,null,null,null,null,null,null,null,null,null,null,null,null,null,null," "," "," "," "," "," "," "," "," "," "," ",0,0,0,0]
[null,null,null,null,null,null,null,null,null,null,null,null,null,null,null,null,null,null,null,null," "," "," "," "," "," "," "," "," "," "," ",0,0,0,0]
[null,null,null,null,null,null,null,null,null,null,null,null,null,null,null,null,null,null,null,null," "," "," "," "," "," "," "," "," "," "," ",0,0,0,0]
[null,null,null,null,null,null,null,null,null,null,null,null,null,null,null,null,null,null,null,null," "," "," "," "," "," "," "," "," "," "," ",0,0,0,0]
[null,null,null,null,null,null,null,null,null,null,null,null,null,null,null,null,null,null,null,null," "," "," "," "," "," "," "," "," "," "," ",0,0,0,0]
[null,null,null,null,null,null,null,null,null,null,null,null,null,null,null,null,null,null,null,null," "," "," "," "," "," "," "," "," "," "," ",0,0,0,0]
[null,null,null,null,null,null,null,null,null,null,null,null,null,null,null,null,null,null,null,null," "," "," "," "," "," "," "," "," "," "," ",0,0,0,0]
[null,null,null,null,null,null,null,null,null,null,null,null,null,null,null,null,null,null,null,null," "," "," "," "," "," "," "," "," "," "," ",0,0,0,0]
[null,null,null,null,null,null,null,null,null,null,null,null,null,null,null,null,null,null,null,null," "," "," "," "," "," "," "," "," "," "," ",0,0,0,0]
[null,null,null,null,null,null,null,null,null,null,null,null,null,null,null,null,null,null,null,null," "," "," "," "," "," "," "," "," "," "," ",0,0,0,0]
[null,null,null,null,null,null,null,null,null,null,null,null,null,null,null,null,null,null,null,null," "," "," "," "," "," "," "," "," "," "," ",0,0,0,0]
[null,null,null,null,null,null,null,null,null,null,null,null,null,null,null,null,null,null,null,null," "," "," "," "," "," "," "," "," "," "," ",0,0,0,0]
[null,null,null,null,null,null,null,null,null,null,null,null,null,null,null,null,null,null,null,null," "," "," "," "," "," "," "," "," "," "," ",0,0,0,0]
[null,null,null,null,null,null,null,null,null,null,null,null,null,null,null,null,null,null,null,null," "," "," "," "," "," "," "," "," "," "," ",0,0,0,0]
[null,null,null,null,null,null,null,null,null,null,null,null,null,null,null,null,null,null,null,null," "," "," "," "," "," "," "," "," "," "," ",0,0,0,0]
[null,null,null,null,null,null,null,null,null,null,null,null,null,null,null,null,null,null,null,null," "," "," "," "," "," "," "," "," "," "," ",0,0,0,0]
[null,null,null,null,null,null,null,null,null,null,null,null,null,null,null,null,null,null,null,null," "," "," "," "," "," "," "," "," "," "," ",0,0,0,0]
[null,null,null,null,null,null,null,null,null,null,null,null,null,null,null,null,null,null,null,null," "," "," "," "," "," "," "," "," "," "," ",0,0,0,0]
[null,null,null,null,null,null,null,null,null,null,null,null,null,null,null,null,null,null,null,null," "," "," "," "," "," "," "," "," "," "," ",0,0,0,0]
[null,null,null,null,null,null,null,null,null,null,null,null,null,null,null,null,null,null,null,null," "," "," "," "," "," "," "," "," "," "," ",0,0,0,0]
[null,null,null,null,null,null,null,null,null,null,null,null,null,null,null,null,null,null,null,null," "," "," "," "," "," "," "," "," "," "," ",0,0,0,0]
[null,null,null,null,null,null,null,null,null,null,null,null,null,null,null,null,null,null,null,null," "," "," "," "," "," "," "," "," "," "," ",0,0,0,0]
[null,null,null,null,null,null,null,null,null,null,null,null,null,null,null,null,null,null,null,null," "," "," "," "," "," "," "," "," "," "," ",{"$f":"IF(H534=\"\",\"0\",IF(OR(AG534>=65,AH534>=55,AI534>=65),MAX(AG534:AI534),0))*1","v":0},0,0,0]
[null,null,null,null,null,null,null,null,null,null,null,null,null,null,null,null,null,null,null,null,{"$f":"IF(H535=\"\",\" \",SEARCH(\"-\",H535))","v":" "},{"$f":"IF(H535=\"\",\" \",LEFT(H535,U535-1))","v":" "},{"$f":"IF(H535=\"\",\" \",MID(H535,U535+1,4))","v":" "},{"$f":"IF(H535=\"\",\" \",V535+W535)","v":" "},{"$f":"IF(H535=\"\",\" \",IF(X535>=4,\"OK\",\"NOT OK\"))","v":" "},{"$f":"IF(N535=\"\",\" \",SEARCH(\"-\",N535))","v":" "},{"$f":"IF(N535=\"\",\" \",LEFT(N535,Z535-1))","v":" "},{"$f":"IF(N535=\"\",\" \",MID(N535,Z535+1,4))","v":" "},{"$f":"IF(N535=\"\",\" \",AA535+AB535)","v":" "},{"$f":"IF(N535=\"\",\" \",IF(AC535>=2,\"OK\",\"NOT OK\"))","v":" "},{"$f":"IF(H535=\"\",\" \",IF(AND(Y535=\"OK\",AD535=\"OK\"),\"OYNA\",IF(Y535=AD535,\"OYNAMA\",IF(Y535=AD535,\"OYNA\",\"OYNAMA\"))))","v":" "},0,{"$f":"IF(H535=\"\",\"0\",SUBSTITUTE(I535,\".\",\",\"))*1","v":0},{"$f":"IF(H535=\"\",\"0\",SUBSTITUTE(J535,\".\",\",\"))*1","v":0},{"$f":"IF(H535=\"\",\"0\",SUBSTITUTE(K535,\".\",\",\"))*1","v":0}]
[null,null,null,null,null,null,null,null,null,null,null,null,null,null,null,null,null,null,null,null," "," "," "," "," "," "," "," "," "," "," ",0,0,0,0]
[null,null,null,null,null,null,null,null,null,null,null,null,null,null,null,null,null,null,null,null," "," "," "," "," "," "," "," "," "," "," ",0,0,0,0]
[null,null,null,null,null,null,null,null,null,null,null,null,null,null,null,null,null,null,null,null," "," "," "," "," "," "," "," "," "," "," ",0,0,0,0]
[null,null,null,null,null,null,null,null,null,null,null,null,null,null,null,null,null,null,null,null," "," "," "," "," "," "," "," "," "," "," ",0,0,0,0]
[null,null,null,null,null,null,null,null,null,null,null,null,null,null,null,null,null,null,null,null," "," "," "," "," "," "," "," "," "," "," ",0,0,0,0]
[null,null,null,null,null,null,null,null,null,null,null,null,null,null,null,null,null,null,null,null," "," "," "," "," "," "," "," "," "," "," ",0,0,0,0]
[null,null,null,null,null,null,null,null,null,null,null,null,null,null,null,null,null,null,null,null," "," "," "," "," "," "," "," "," "," "," ",0,0,0,0]
[null,null,null,null,null,null,null,null,null,null,null,null,null,null,null,null,null,null,null,null," "," "," "," "," "," "," "," "," "," "," ",0,0,0,0]
[null,null,null,null,null,null,null,null,null,null,null,null,null,null,null,null,null,null,null,null," "," "," "," "," "," "," "," "," "," "," ",0,0,0,0]
[null,null,null,null,null,null,null,null,null,null,null,null,null,null,null,null,null,null,null,null," "," "," "," "," "," "," "," "," "," "," ",0,0,0,0]
[null,null,null,null,null,null,null,null,null,null,null,null,null,null,null,null,null,null,null,null," "," "," "," "," "," "," "," "," "," "," ",0,0,0,0]
[null,null,null,null,null,null,null,null,null,null,null,null,null,null,null,null,null,null,null,null," "," "," "," "," "," "," "," "," "," "," ",0,0,0,0]
[null,null,null,null,null,null,null,null,null,null,null,null,null,null,null,null,null,null,null,null," "," "," "," "," "," "," "," "," "," "," ",0,0,0,0]
[null,null,null,null,null,null,null,null,null,null,null,null,null,null,null,null,null,null,null,null," "," "," "," "," "," "," "," "," "," "," ",0,0,0,0]
[null,null,null,null,null,null,null,null,null,null,null,null,null,null,null,null,null,null,null,null," "," "," "," "," "," "," "," "," "," "," ",0,0,0,0]
[null,null,null,null,null,null,null,null,null,null,null,null,null,null,null,null,null,null,null,null," "," "," "," "," "," "," "," "," "," "," ",0,0,0,0]
[null,null,null,null,null,null,null,null,null,null,null,null,null,null,null,null,null,null,null,null," "," "," "," "," "," "," "," "," "," "," ",0,0,0,0]
[null,null,null,null,null,null,null,null,null,null,null,null,null,null,null,null,null,null,null,null," "," "," "," "," "," "," "," "," "," "," ",0,0,0,0]
[null,null,null,null,null,null,null,null,null,null,null,null,null,null,null,null,null,null,null,null," "," "," "," "," "," "," "," "," "," "," ",0,0,0,0]
[null,null,null,null,null,null,null,null,null,null,null,null,null,null,null,null,null,null,null,null," "," "," "," "," "," "," "," "," "," "," ",0,0,0,0]
[null,null,null,null,null,null,null,null,null,null,null,null,null,null,null,null,null,null,null,null," "," "," "," "," "," "," "," "," "," "," ",0,0,0,0]
[null,null,null,null,null,null,null,null,null,null,null,null,null,null,null,null,null,null,null,null," "," "," "," "," "," "," "," "," "," "," ",0,0,0,0]
[null,null,null,null,null,null,null,null,null,null,null,null,null,null,null,null,null,null,null,null," "," "," "," "," "," "," "," "," "," "," ",0,0,0,0]
[null,null,null,null,null,null,null,null,null,null,null,null,null,null,null,null,null,null,null,null," "," "," "," "," "," "," "," "," "," "," ",0,0,0,0]
[null,null,null,null,null,null,null,null,null,null,null,null,null,null,null,null,null,null,null,null," "," "," "," "," "," "," "," "," "," "," ",0,0,0,0]
[null,null,null,null,null,null,null,null,null,null,null,null,null,null,null,null,null,null,null,null," "," "," "," "," "," "," "," "," "," "," ",0,0,0,0]
[null,null,null,null,null,null,null,null,null,null,null,null,null,null,null,null,null,null,null,null," "," "," "," "," "," "," "," "," "," "," ",0,0,0,0]
[null,null,null,null,null,null,null,null,null,null,null,null,null,null,null,null,null,null,null,null," "," "," "," "," "," "," "," "," "," "," ",0,0,0,0]
[null,null,null,null,null,null,null,null,null,null,null,null,null,null,null,null,null,null,null,null," "," "," "," "," "," "," "," "," "," "," ",0,0,0,0]
[null,null,null,null,null,null,null,null,null,null,null,null,null,null,null,null,null,null,null,null," "," "," "," "," "," "," "," "," "," "," ",0,0,0,0]
[null,null,null,null,null,null,null,null,null,null,null,null,null,null,null,null,null,null,null,null," "," "," "," "," "," "," "," "," "," "," ",0,0,0,0]
[null,null,null,null,null,null,null,null,null,null,null,null,null,null,null,null,null,null,null,null," "," "," "," "," "," "," "," "," "," "," ",0,0,0,0]
[null,null,null,null,null,null,null,null,null,null,null,null,null,null,null,null,null,null,null,null," "," "," "," "," "," "," "," "," "," "," ",0,0,0,0]
[null,null,null,null,null,null,null,null,null,null,null,null,null,null,null,null,null,null,null,null," "," "," "," "," "," "," "," "," "," "," ",0,0,0,0]
[null,null,null,null,null,null,null,null,null,null,null,null,null,null,null,null,null,null,null,null," "," "," "," "," "," "," "," "," "," "," ",0,0,0,0]
[null,null,null,null,null,null,null,null,null,null,null,null,null,null,null,null,null,null,null,null," "," "," "," "," "," "," "," "," "," "," ",0,0,0,0]
[null,null,null,null,null,null,null,null,null,null,null,null,null,null,null,null,null,null,null,null," "," "," "," "," "," "," "," "," "," "," ",0,0,0,0]
[null,null,null,null,null,null,null,null,null,null,null,null,null,null,null,null,null,null,null,null," "," "," "," "," "," "," "," "," "," "," ",0,0,0,0]
[null,null,null,null,null,null,null,null,null,null,null,null,null,null,null,null,null,null,null,null," "," "," "," "," "," "," "," "," "," "," ",0,0,0,0]
[null,null,null,null,null,null,null,null,null,null,null,null,null,null,null,null,null,null,null,null," "," "," "," "," "," "," "," "," "," "," ",0,0,0,0]
[null,null,null,null,null,null,null,null,null,null,null,null,null,null,null,null,null,null,null,null," "," "," "," "," "," "," "," "," "," "," ",0,0,0,0]
[null,null,null,null,null,null,null,null,null,null,null,null,null,null,null,null,null,null,null,null," "," "," "," "," "," "," "," "," "," "," ",0,0,0,0]
[null,null,null,null,null,null,null,null,null,null,null,null,null,null,null,null,null,null,null,null," "," "," "," "," "," "," "," "," "," "," ",0,0,0,0]
[null,null,null,null,null,null,null,null,null,null,null,null,null,null,null,null,null,null,null,null," "," "," "," "," "," "," "," "," "," "," ",0,0,0,0]
[null,null,null,null,null,null,null,null,null,null,null,null,null,null,null,null,null,null,null,null," "," "," "," "," "," "," "," "," "," "," ",0,0,0,0]
[null,null,null,null,null,null,null,null,null,null,null,null,null,null,null,null,null,null,null,null," "," "," "," "," "," "," "," "," "," "," ",0,0,0,0]
[null,null,null,null,null,null,null,null,null,null,null,null,null,null,null,null,null,null,null,null," "," "," "," "," "," "," "," "," "," "," ",0,0,0,0]
[null,null,null,null,null,null,null,null,null,null,null,null,null,null,null,null,null,null,null,null," "," "," "," "," "," "," "," "," "," "," ",0,0,0,0]
[null,null,null,null,null,null,null,null,null,null,null,null,null,null,null,null,null,null,null,null," "," "," "," "," "," "," "," "," "," "," ",0,0,0,0]
[null,null,null,null,null,null,null,null,null,null,null,null,null,null,null,null,null,null,null,null," "," "," "," "," "," "," "," "," "," "," ",0,0,0,0]
[null,null,null,null,null,null,null,null,null,null,null,null,null,null,null,null,null,null,null,null," "," "," "," "," "," "," "," "," "," "," ",0,0,0,0]
[null,null,null,null,null,null,null,null,null,null,null,null,null,null,null,null,null,null,null,null," "," "," "," "," "," "," "," "," "," "," ",0,0,0,0]
[null,null,null,null,null,null,null,null,null,null,null,null,null,null,null,null,null,null,null,null," "," "," "," "," "," "," "," "," "," "," ",0,0,0,0]
[null,null,null,null,null,null,null,null,null,null,null,null,null,null,null,null,null,null,null,null," "," "," "," "," "," "," "," "," "," "," ",0,0,0,0]
[null,null,null,null,null,null,null,null,null,null,null,null,null,null,null,null,null,null,null,null," "," "," "," "," "," "," "," "," "," "," ",0,0,0,0]
[null,null,null,null,null,null,null,null,null,null,null,null,null,null,null,null,null,null,null,null," "," "," "," "," "," "," "," "," "," "," ",0,0,0,0]
[null,null,null,null,null,null,null,null,null,null,null,null,null,null,null,null,null,null,null,null," "," "," "," "," "," "," "," "," "," "," ",0,0,0,0]
[null,null,null,null,null,null,null,null,null,null,null,null,null,null,null,null,null,null,null,null," "," "," "," "," "," "," "," "," "," "," ",0,0,0,0]
[null,null,null,null,null,null,null,null,null,null,null,null,null,null,null,null,null,null,null,null," "," "," "," "," "," "," "," "," "," "," ",0,0,0,0]
[null,null,null,null,null,null,null,null,null,null,null,null,null,null,null,null,null,null,null,null," "," "," "," "," "," "," "," "," "," "," ",0,0,0,0]
[null,null,null,null,null,null,null,null,null,null,null,null,null,null,null,null,null,null,null,null," "," "," "," "," "," "," "," "," "," "," ",0,0,0,0]
[null,null,null,null,null,null,null,null,null,null,null,null,null,null,null,null,null,null,null,null," "," "," "," "," "," "," "," "," "," "," ",0,0,0,0]
[null,null,null,null,null,null,null,null,null,null,null,null,null,null,null,null,null,null,null,null," "," "," "," "," "," "," "," "," "," "," ",{"$f":"IF(H598=\"\",\"0\",IF(OR(AG598>=65,AH598>=55,AI598>=65),MAX(AG598:AI598),0))*1","v":0},0,0,0]
[null,null,null,null,null,null,null,null,null,null,null,null,null,null,null,null,null,null,null,null,{"$f":"IF(H599=\"\",\" \",SEARCH(\"-\",H599))","v":" "},{"$f":"IF(H599=\"\",\" \",LEFT(H599,U599-1))","v":" "},{"$f":"IF(H599=\"\",\" \",MID(H599,U599+1,4))","v":" "},{"$f":"IF(H599=\"\",\" \",V599+W599)","v":" "},{"$f":"IF(H599=\"\",\" \",IF(X599>=4,\"OK\",\"NOT OK\"))","v":" "},{"$f":"IF(N599=\"\",\" \",SEARCH(\"-\",N599))","v":" "},{"$f":"IF(N599=\"\",\" \",LEFT(N599,Z599-1))","v":" "},{"$f":"IF(N599=\"\",\" \",MID(N599,Z599+1,4))","v":" "},{"$f":"IF(N599=\"\",\" \",AA599+AB599)","v":" "},{"$f":"IF(N599=\"\",\" \",IF(AC599>=2,\"OK\",\"NOT OK\"))","v":" "},{"$f":"IF(H599=\"\",\" \",IF(AND(Y599=\"OK\",AD599=\"OK\"),\"OYNA\",IF(Y599=AD599,\"OYNAMA\",IF(Y599=AD599,\"OYNA\",\"OYNAMA\"))))","v":" "},0,{"$f":"IF(H599=\"\",\"0\",SUBSTITUTE(I599,\".\",\",\"))*1","v":0},{"$f":"IF(H599=\"\",\"0\",SUBSTITUTE(J599,\".\",\",\"))*1","v":0},{"$f":"IF(H599=\"\",\"0\",SUBSTITUTE(K599,\".\",\",\"))*1","v":0}]
[null,null,null,null,null,null,null,null,null,null,null,null,null,null,null,null,null,null,null,null," "," "," "," "," "," "," "," "," "," "," ",0,0,0,0]
[null,null,null,null,null,null,null,null,null,null,null,null,null,null,null,null,null,null,null,null," "," "," "," "," "," "," "," "," "," "," ",0,0,0,0]
[null,null,null,null,null,null,null,null,null,null,null,null,null,null,null,null,null,null,null,null," "," "," "," "," "," "," "," "," "," "," ",0,0,0,0]
[null,null,null,null,null,null,null,null,null,null,null,null,null,null,null,null,null,null,null,null," "," "," "," "," "," "," "," "," "," "," ",0,0,0,0]
[null,null,null,null,null,null,null,null,null,null,null,null,null,null,null,null,null,null,null,null," "," "," "," "," "," "," "," "," "," "," ",0,0,0,0]
[null,null,null,null,null,null,null,null,null,null,null,null,null,null,null,null,null,null,null,null," "," "," "," "," "," "," "," "," "," "," ",0,0,0,0]
[null,null,null,null,null,null,null,null,null,null,null,null,null,null,null,null,null,null,null,null," "," "," "," "," "," "," "," "," "," "," ",0,0,0,0]
[null,null,null,null,null,null,null,null,null,null,null,null,null,null,null,null,null,null,null,null," "," "," "," "," "," "," "," "," "," "," ",0,0,0,0]
[null,null,null,null,null,null,null,null,null,null,null,null,null,null,null,null,null,null,null,null," "," "," "," "," "," "," "," "," "," "," ",0,0,0,0]
[null,null,null,null,null,null,null,null,null,null,null,null,null,null,null,null,null,null,null,null," "," "," "," "," "," "," "," "," "," "," ",0,0,0,0]
[null,null,null,null,null,null,null,null,null,null,null,null,null,null,null,null,null,null,null,null," "," "," "," "," "," "," "," "," "," "," ",0,0,0,0]
[null,null,null,null,null,null,null,null,null,null,null,null,null,null,null,null,null,null,null,null," "," "," "," "," "," "," "," "," "," "," ",0,0,0,0]
[null,null,null,null,null,null,null,null,null,null,null,null,null,null,null,null,null,null,null,null," "," "," "," "," "," "," "," "," "," "," ",0,0,0,0]
[null,null,null,null,null,null,null,null,null,null,null,null,null,null,null,null,null,null,null,null," "," "," "," "," "," "," "," "," "," "," ",0,0,0,0]
[null,null,null,null,null,null,null,null,null,null,null,null,null,null,null,null,null,null,null,null," "," "," "," "," "," "," "," "," "," "," ",0,0,0,0]
[null,null,null,null,null,null,null,null,null,null,null,null,null,null,null,null,null,null,null,null," "," "," "," "," "," "," "," "," "," "," ",0,0,0,0]
[null,null,null,null,null,null,null,null,null,null,null,null,null,null,null,null,null,null,null,null," "," "," "," "," "," "," "," "," "," "," ",0,0,0,0]
[null,null,null,null,null,null,null,null,null,null,null,null,null,null,null,null,null,null,null,null," "," "," "," "," "," "," "," "," "," "," ",0,0,0,0]
[null,null,null,null,null,null,null,null,null,null,null,null,null,null,null,null,null,null,null,null," "," "," "," "," "," "," "," "," "," "," ",0,0,0,0]
[null,null,null,null,null,null,null,null,null,null,null,null,null,null,null,null,null,null,null,null," "," "," "," "," "," "," "," "," "," "," ",0,0,0,0]
[null,null,null,null,null,null,null,null,null,null,null,null,null,null,null,null,null,null,null,null," "," "," "," "," "," "," "," "," "," "," ",0,0,0,0]
[null,null,null,null,null,null,null,null,null,null,null,null,null,null,null,null,null,null,null,null," "," "," "," "," "," "," "," "," "," "," ",0,0,0,0]
[null,null,null,null,null,null,null,null,null,null,null,null,null,null,null,null,null,null,null,null," "," "," "," "," "," "," "," "," "," "," ",0,0,0,0]
[null,null,null,null,null,null,null,null,null,null,null,null,null,null,null,null,null,null,null,null," "," "," "," "," "," "," "," "," "," "," ",0,0,0,0]
[null,null,null,null,null,null,null,null,null,null,null,null,null,null,null,null,null,null,null,null," "," "," "," "," "," "," "," "," "," "," ",0,0,0,0]
[null,null,null,null,null,null,null,null,null,null,null,null,null,null,null,null,null,null,null,null," "," "," "," "," "," "," "," "," "," "," ",0,0,0,0]
[null,null,null,null,null,null,null,null,null,null,null,null,null,null,null,null,null,null,null,null," "," "," "," "," "," "," "," "," "," "," ",0,0,0,0]
[null,null,null,null,null,null,null,null,null,null,null,null,null,null,null,null,null,null,null,null," "," "," "," "," "," "," "," "," "," "," ",0,0,0,0]
[null,null,null,null,null,null,null,null,null,null,null,null,null,null,null,null,null,null,null,null," "," "," "," "," "," "," "," "," "," "," ",0,0,0,0]
[null,null,null,null,null,null,null,null,null,null,null,null,null,null,null,null,null,null,null,null," "," "," "," "," "," "," "," "," "," "," ",0,0,0,0]
[null,null,null,null,null,null,null,null,null,null,null,null,null,null,null,null,null,null,null,null," "," "," "," "," "," "," "," "," "," "," ",0,0,0,0]
[null,null,null,null,null,null,null,null,null,null,null,null,null,null,null,null,null,null,null,null," "," "," "," "," "," "," "," "," "," "," ",0,0,0,0]
[null,null,null,null,null,null,null,null,null,null,null,null,null,null,null,null,null,null,null,null," "," "," "," "," "," "," "," "," "," "," ",0,0,0,0]
[null,null,null,null,null,null,null,null,null,null,null,null,null,null,null,null,null,null,null,null," "," "," "," "," "," "," "," "," "," "," ",0,0,0,0]
[null,null,null,null,null,null,null,null,null,null,null,null,null,null,null,null,null,null,null,null," "," "," "," "," "," "," "," "," "," "," ",0,0,0,0]
[null,null,null,null,null,null,null,null,null,null,null,null,null,null,null,null,null,null,null,null," "," "," "," "," "," "," "," "," "," "," ",0,0,0,0]
[null,null,null,null,null,null,null,null,null,null,null,null,null,null,null,null,null,null,null,null," "," "," "," "," "," "," "," "," "," "," ",0,0,0,0]
[null,null,null,null,null,null,null,null,null,null,null,null,null,null,null,null,null,null,null,null," "," "," "," "," "," "," "," "," "," "," ",0,0,0,0]
[null,null,null,null,null,null,null,null,null,null,null,null,null,null,null,null,null,null,null,null," "," "," "," "," "," "," "," "," "," "," ",0,0,0,0]
[null,null,null,null,null,null,null,null,null,null,null,null,null,null,null,null,null,null,null,null," "," "," "," "," "," "," "," "," "," "," ",0,0,0,0]
[null,null,null,null,null,null,null,null,null,null,null,null,null,null,null,null,null,null,null,null," "," "," "," "," "," "," "," "," "," "," ",0,0,0,0]
[null,null,null,null,null,null,null,null,null,null,null,null,null,null,null,null,null,null,null,null," "," "," "," "," "," "," "," "," "," "," ",0,0,0,0]
[null,null,null,null,null,null,null,null,null,null,null,null,null,null,null,null,null,null,null,null," "," "," "," "," "," "," "," "," "," "," ",0,0,0,0]
[null,null,null,null,null,null,null,null,null,null,null,null,null,null,null,null,null,null,null,null," "," "," "," "," "," "," "," "," "," "," ",0,0,0,0]
[null,null,null,null,null,null,null,null,null,null,null,null,null,null,null,null,null,null,null,null," "," "," "," "," "," "," "," "," "," "," ",0,0,0,0]
[null,null,null,null,null,null,null,null,null,null,null,null,null,null,null,null,null,null,null,null," "," "," "," "," "," "," "," "," "," "," ",0,0,0,0]
[null,null,null,null,null,null,null,null,null,null,null,null,null,null,null,null,null,null,null,null," "," "," "," "," "," "," "," "," "," "," ",0,0,0,0]
[null,null,null,null,null,null,null,null,null,null,null,null,null,null,null,null,null,null,null,null," "," "," "," "," "," "," "," "," "," "," ",0,0,0,0]
[null,null,null,null,null,null,null,null,null,null,null,null,null,null,null,null,null,null,null,null," "," "," "," "," "," "," "," "," "," "," ",0,0,0,0]
[null,null,null,null,null,null,null,null,null,null,null,null,null,null,null,null,null,null,null,null," "," "," "," "," "," "," "," "," "," "," ",0,0,0,0]
[null,null,null,null,null,null,null,null,null,null,null,null,null,null,null,null,null,null,null,null," "," "," "," "," "," "," "," "," "," "," ",0,0,0,0]
[null,null,null,null,null,null,null,null,null,null,null,null,null,null,null,null,null,null,null,null," "," "," "," "," "," "," "," "," "," "," ",0,0,0,0]
[null,null,null,null,null,null,null,null,null,null,null,null,null,null,null,null,null,null,null,null," "," "," "," "," "," "," "," "," "," "," ",0,0,0,0]
[null,null,null,null,null,null,null,null,null,null,null,null,null,null,null,null,null,null,null,null," "," "," "," "," "," "," "," "," "," "," ",0,0,0,0]
[null,null,null,null,null,null,null,null,null,null,null,null,null,null,null,null,null,null,null,null," "," "," "," "," "," "," "," "," "," "," ",0,0,0,0]
[null,null,null,null,null,null,null,null,null,null,null,null,null,null,null,null,null,null,null,null," "," "," "," "," "," "," "," "," "," "," ",0,0,0,0]
[null,null,null,null,null,null,null,null,null,null,null,null,null,null,null,null,null,null,null,null," "," "," "," "," "," "," "," "," "," "," ",0,0,0,0]
[null,null,null,null,null,null,null,null,null,null,null,null,null,null,null,null,null,null,null,null," "," "," "," "," "," "," "," "," "," "," ",0,0,0,0]
[null,null,null,null,null,null,null,null,null,null,null,null,null,null,null,null,null,null,null,null," "," "," "," "," "," "," "," "," "," "," ",0,0,0,0]
[null,null,null,null,null,null,null,null,null,null,null,null,null,null,null,null,null,null,null,null," "," "," "," "," "," "," "," "," "," "," ",0,0,0,0]
[null,null,null,null,null,null,null,null,null,null,null,null,null,null,null,null,null,null,null,null," "," "," "," "," "," "," "," "," "," "," ",0,0,0,0]
[null,null,null,null,null,null,null,null,null,null,null,null,null,null,null,null,null,null,null,null," "," "," "," "," "," "," "," "," "," "," ",0,0,0,0]
[null,null,null,null,null,null,null,null,null,null,null,null,null,null,null,null,null,null,null,null," "," "," "," "," "," "," "," "," "," "," ",{"$f":"IF(H662=\"\",\"0\",IF(OR(AG662>=65,AH662>=55,AI662>=65),MAX(AG662:AI662),0))*1","v":0},0,0,0]
[null,null,null,null,null,null,null,null,null,null,null,null,null,null,null,null,null,null,null,null,{"$f":"IF(H663=\"\",\" \",SEARCH(\"-\",H663))","v":" "},{"$f":"IF(H663=\"\",\" \",LEFT(H663,U663-1))","v":" "},{"$f":"IF(H663=\"\",\" \",MID(H663,U663+1,4))","v":" "},{"$f":"IF(H663=\"\",\" \",V663+W663)","v":" "},{"$f":"IF(H663=\"\",\" \",IF(X663>=4,\"OK\",\"NOT OK\"))","v":" "},{"$f":"IF(N663=\"\",\" \",SEARCH(\"-\",N663))","v":" "},{"$f":"IF(N663=\"\",\" \",LEFT(N663,Z663-1))","v":" "},{"$f":"IF(N663=\"\",\" \",MID(N663,Z663+1,4))","v":" "},{"$f":"IF(N663=\"\",\" \",AA663+AB663)","v":" "},{"$f":"IF(N663=\"\",\" \",IF(AC663>=2,\"OK\",\"NOT OK\"))","v":" "},{"$f":"IF(H663=\"\",\" \",IF(AND(Y663=\"OK\",AD663=\"OK\"),\"OYNA\",IF(Y663=AD663,\"OYNAMA\",IF(Y663=AD663,\"OYNA\",\"OYNAMA\"))))","v":" "},0,{"$f":"IF(H663=\"\",\"0\",SUBSTITUTE(I663,\".\",\",\"))*1","v":0},{"$f":"IF(H663=\"\",\"0\",SUBSTITUTE(J663,\".\",\",\"))*1","v":0},{"$f":"IF(H663=\"\",\"0\",SUBSTITUTE(K663,\".\",\",\"))*1","v":0}]
[null,null,null,null,null,null,null,null,null,null,null,null,null,null,null,null,null,null,null,null," "," "," "," "," "," "," "," "," "," "," ",0,0,0,0]
[null,null,null,null,null,null,null,null,null,null,null,null,null,null,null,null,null,null,null,null," "," "," "," "," "," "," "," "," "," "," ",0,0,0,0]
[null,null,null,null,null,null,null,null,null,null,null,null,null,null,null,null,null,null,null,null," "," "," "," "," "," "," "," "," "," "," ",0,0,0,0]
[null,null,null,null,null,null,null,null,null,null,null,null,null,null,null,null,null,null,null,null," "," "," "," "," "," "," "," "," "," "," ",0,0,0,0]
[null,null,null,null,null,null,null,null,null,null,null,null,null,null,null,null,null,null,null,null," "," "," "," "," "," "," "," "," "," "," ",0,0,0,0]
[null,null,null,null,null,null,null,null,null,null,null,null,null,null,null,null,null,null,null,null," "," "," "," "," "," "," "," "," "," "," ",0,0,0,0]
[null,null,null,null,null,null,null,null,null,null,null,null,null,null,null,null,null,null,null,null," "," "," "," "," "," "," "," "," "," "," ",0,0,0,0]
[null,null,null,null,null,null,null,null,null,null,null,null,null,null,null,null,null,null,null,null," "," "," "," "," "," "," "," "," "," "," ",0,0,0,0]
[null,null,null,null,null,null,null,null,null,null,null,null,null,null,null,null,null,null,null,null," "," "," "," "," "," "," "," "," "," "," ",0,0,0,0]
[null,null,null,null,null,null,null,null,null,null,null,null,null,null,null,null,null,null,null,null," "," "," "," "," "," "," "," "," "," "," ",0,0,0,0]
[null,null,null,null,null,null,null,null,null,null,null,null,null,null,null,null,null,null,null,null," "," "," "," "," "," "," "," "," "," "," ",0,0,0,0]
[null,null,null,null,null,null,null,null,null,null,null,null,null,null,null,null,null,null,null,null," "," "," "," "," "," "," "," "," "," "," ",0,0,0,0]
[null,null,null,null,null,null,null,null,null,null,null,null,null,null,null,null,null,null,null,null," "," "," "," "," "," "," "," "," "," "," ",0,0,0,0]
[null,null,null,null,null,null,null,null,null,null,null,null,null,null,null,null,null,null,null,null," "," "," "," "," "," "," "," "," "," "," ",0,0,0,0]
[null,null,null,null,null,null,null,null,null,null,null,null,null,null,null,null,null,null,null,null," "," "," "," "," "," "," "," "," "," "," ",0,0,0,0]
[null,null,null,null,null,null,null,null,null,null,null,null,null,null,null,null,null,null,null,null," "," "," "," "," "," "," "," "," "," "," ",0,0,0,0]
[null,null,null,null,null,null,null,null,null,null,null,null,null,null,null,null,null,null,null,null," "," "," "," "," "," "," "," "," "," "," ",0,0,0,0]
[null,null,null,null,null,null,null,null,null,null,null,null,null,null,null,null,null,null,null,null," "," "," "," "," "," "," "," "," "," "," ",0,0,0,0]
[null,null,null,null,null,null,null,null,null,null,null,null,null,null,null,null,null,null,null,null," "," "," "," "," "," "," "," "," "," "," ",0,0,0,0]
[null,null,null,null,null,null,null,null,null,null,null,null,null,null,null,null,null,null,null,null," "," "," "," "," "," "," "," "," "," "," ",0,0,0,0]
[null,null,null,null,null,null,null,null,null,null,null,null,null,null,null,null,null,null,null,null," "," "," "," "," "," "," "," "," "," "," ",0,0,0,0]
[null,null,null,null,null,null,null,null,null,null,null,null,null,null,null,null,null,null,null,null," "," "," "," "," "," "," "," "," "," "," ",0,0,0,0]
[null,null,null,null,null,null,null,null,null,null,null,null,null,null,null,null,null,null,null,null," "," "," "," "," "," "," "," "," "," "," ",0,0,0,0]
[null,null,null,null,null,null,null,null,null,null,null,null,null,null,null,null,null,null,null,null," "," "," "," "," "," "," "," "," "," "," ",0,0,0,0]
[null,null,null,null,null,null,null,null,null,null,null,null,null,null,null,null,null,null,null,null," "," "," "," "," "," "," "," "," "," "," ",0,0,0,0]
[null,null,null,null,null,null,null,null,null,null,null,null,null,null,null,null,null,null,null,null," "," "," "," "," "," "," "," "," "," "," ",0,0,0,0]
[null,null,null,null,null,null,null,null,null,null,null,null,null,null,null,null,null,null,null,null," "," "," "," "," "," "," "," "," "," "," ",0,0,0,0]
[null,null,null,null,null,null,null,null,null,null,null,null,null,null,null,null,null,null,null,null," "," "," "," "," "," "," "," "," "," "," ",0,0,0,0]
[null,null,null,null,null,null,null,null,null,null,null,null,null,null,null,null,null,null,null,null," "," "," "," "," "," "," "," "," "," "," ",0,0,0,0]
[null,null,null,null,null,null,null,null,null,null,null,null,null,null,null,null,null,null,null,null," "," "," "," "," "," "," "," "," "," "," ",0,0,0,0]
[null,null,null,null,null,null,null,null,null,null,null,null,null,null,null,null,null,null,null,null," "," "," "," "," "," "," "," "," "," "," ",0,0,0,0]
[null,null,null,null,null,null,null,null,null,null,null,null,null,null,null,null,null,null,null,null," "," "," "," "," "," "," "," "," "," "," ",0,0,0,0]
[null,null,null,null,null,null,null,null,null,null,null,null,null,null,null,null,null,null,null,null," "," "," "," "," "," "," "," "," "," "," ",0,0,0,0]
[null,null,null,null,null,null,null,null,null,null,null,null,null,null,null,null,null,null,null,null," "," "," "," "," "," "," "," "," "," "," ",0,0,0,0]
[null,null,null,null,null,null,null,null,null,null,null,null,null,null,null,null,null,null,null,null," "," "," "," "," "," "," "," "," "," "," ",0,0,0,0]
[null,null,null,null,null,null,null,null,null,null,null,null,null,null,null,null,null,null,null,null," "," "," "," "," "," "," "," "," "," "," ",0,0,0,0]
[null,null,null,null,null,null,null,null,null,null,null,null,null,null,null,null,null,null,null,null," "," "," "," "," "," "," "," "," "," "," ",0,0,0,0]
[null,null,null,null,null,null,null,null,null,null,null,null,null,null,null,null,null,null,null,null," "," "," "," "," "," "," "," "," "," "," ",0,0,0,0]
[null,null,null,null,null,null,null,null,null,null,null,null,null,null,null,null,null,null,null,null," "," "," "," "," "," "," "," "," "," "," ",0,0,0,0]
[null,null,null,null,null,null,null,null,null,null,null,null,null,null,null,null,null,null,null,null," "," "," "," "," "," "," "," "," "," "," ",0,0,0,0]
[null,null,null,null,null,null,null,null,null,null,null,null,null,null,null,null,null,null,null,null," "," "," "," "," "," "," "," "," "," "," ",0,0,0,0]
[null,null,null,null,null,null,null,null,null,null,null,null,null,null,null,null,null,null,null,null," "," "," "," "," "," "," "," "," "," "," ",0,0,0,0]
[null,null,null,null,null,null,null,null,null,null,null,null,null,null,null,null,null,null,null,null," "," "," "," "," "," "," "," "," "," "," ",0,0,0,0]
[null,null,null,null,null,null,null,null,null,null,null,null,null,null,null,null,null,null,null,null," "," "," "," "," "," "," "," "," "," "," ",0,0,0,0]
[null,null,null,null,null,null,null,null,null,null,null,null,null,null,null,null,null,null,null,null," "," "," "," "," "," "," "," "," "," "," ",0,0,0,0]
[null,null,null,null,null,null,null,null,null,null,null,null,null,null,null,null,null,null,null,null," "," "," "," "," "," "," "," "," "," "," ",0,0,0,0]
[null,null,null,null,null,null,null,null,null,null,null,null,null,null,null,null,null,null,null,null," "," "," "," "," "," "," "," "," "," "," ",0,0,0,0]
[null,null,null,null,null,null,null,null,null,null,null,null,null,null,null,null,null,null,null,null," "," "," "," "," "," "," "," "," "," "," ",0,0,0,0]
[null,null,null,null,null,null,null,null,null,null,null,null,null,null,null,null,null,null,null,null," "," "," "," "," "," "," "," "," "," "," ",0,0,0,0]
[null,null,null,null,null,null,null,null,null,null,null,null,null,null,null,null,null,null,null,null," "," "," "," "," "," "," "," "," "," "," ",0,0,0,0]
[null,null,null,null,null,null,null,null,null,null,null,null,null,null,null,null,null,null,null,null," "," "," "," "," "," "," "," "," "," "," ",0,0,0,0]
[null,null,null,null,null,null,null,null,null,null,null,null,null,null,null,null,null,null,null,null," "," "," "," "," "," "," "," "," "," "," ",0,0,0,0]
[null,null,null,null,null,null,null,null,null,null,null,null,null,null,null,null,null,null,null,null," "," "," "," "," "," "," "," "," "," "," ",0,0,0,0]
[null,null,null,null,null,null,null,null,null,null,null,null,null,null,null,null,null,null,null,null," "," "," "," "," "," "," "," "," "," "," ",0,0,0,0]
[null,null,null,null,null,null,null,null,null,null,null,null,null,null,null,null,null,null,null,null," "," "," "," "," "," "," "," "," "," "," ",0,0,0,0]
[null,null,null,null,null,null,null,null,null,null,null,null,null,null,null,null,null,null,null,null," "," "," "," "," "," "," "," "," "," "," ",0,0,0,0]
[null,null,null,null,null,null,null,null,null,null,null,null,null,null,null,null,null,null,null,null," "," "," "," "," "," "," "," "," "," "," ",0,0,0,0]
[null,null,null,null,null,null,null,null,null,null,null,null,null,null,null,null,null,null,null,null," "," "," "," "," "," "," "," "," "," "," ",0,0,0,0]
[null,null,null,null,null,null,null,null,null,null,null,null,null,null,null,null,null,null,null,null," "," "," "," "," "," "," "," "," "," "," ",0,0,0,0]
[null,null,null,null,null,null,null,null,null,null,null,null,null,null,null,null,null,null,null,null," "," "," "," "," "," "," "," "," "," "," ",0,0,0,0]
[null,null,null,null,null,null,null,null,null,null,null,null,null,null,null,null,null,null,null,null," "," "," "," "," "," "," "," "," "," "," ",0,0,0,0]
[null,null,null,null,null,null,null,null,null,null,null,null,null,null,null,null,null,null,null,null," "," "," "," "," "," "," "," "," "," "," ",0,0,0,0]
[null,null,null,null,null,null,null,null,null,null,null,null,null,null,null,null,null,null,null,null," "," "," "," "," "," "," "," "," "," "," ",{"$f":"IF(H726=\"\",\"0\",IF(OR(AG726>=65,AH726>=55,AI726>=65),MAX(AG726:AI726),0))*1","v":0},0,0,0]
[null,null,null,null,null,null,null,null,null,null,null,null,null,null,null,null,null,null,null,null,{"$f":"IF(H727=\"\",\" \",SEARCH(\"-\",H727))","v":" "},{"$f":"IF(H727=\"\",\" \",LEFT(H727,U727-1))","v":" "},{"$f":"IF(H727=\"\",\" \",MID(H727,U727+1,4))","v":" "},{"$f":"IF(H727=\"\",\" \",V727+W727)","v":" "},{"$f":"IF(H727=\"\",\" \",IF(X727>=4,\"OK\",\"NOT OK\"))","v":" "},{"$f":"IF(N727=\"\",\" \",SEARCH(\"-\",N727))","v":" "},{"$f":"IF(N727=\"\",\" \",LEFT(N727,Z727-1))","v":" "},{"$f":"IF(N727=\"\",\" \",MID(N727,Z727+1,4))","v":" "},{"$f":"IF(N727=\"\",\" \",AA727+AB727)","v":" "},{"$f":"IF(N727=\"\",\" \",IF(AC727>=2,\"OK\",\"NOT OK\"))","v":" "},{"$f":"IF(H727=\"\",\" \",IF(AND(Y727=\"OK\",AD727=\"OK\"),\"OYNA\",IF(Y727=AD727,\"OYNAMA\",IF(Y727=AD727,\"OYNA\",\"OYNAMA\"))))","v":" "},0,{"$f":"IF(H727=\"\",\"0\",SUBSTITUTE(I727,\".\",\",\"))*1","v":0},{"$f":"IF(H727=\"\",\"0\",SUBSTITUTE(J727,\".\",\",\"))*1","v":0},{"$f":"IF(H727=\"\",\"0\",SUBSTITUTE(K727,\".\",\",\"))*1","v":0}]
[null,null,null,null,null,null,null,null,null,null,null,null,null,null,null,null,null,null,null,null," "," "," "," "," "," "," "," "," "," "," ",0,0,0,0]
[null,null,null,null,null,null,null,null,null,null,null,null,null,null,null,null,null,null,null,null," "," "," "," "," "," "," "," "," "," "," ",0,0,0,0]
[null,null,null,null,null,null,null,null,null,null,null,null,null,null,null,null,null,null,null,null," "," "," "," "," "," "," "," "," "," "," ",0,0,0,0]
[null,null,null,null,null,null,null,null,null,null,null,null,null,null,null,null,null,null,null,null," "," "," "," "," "," "," "," "," "," "," ",0,0,0,0]
[null,null,null,null,null,null,null,null,null,null,null,null,null,null,null,null,null,null,null,null," "," "," "," "," "," "," "," "," "," "," ",0,0,0,0]
[null,null,null,null,null,null,null,null,null,null,null,null,null,null,null,null,null,null,null,null," "," "," "," "," "," "," "," "," "," "," ",0,0,0,0]
[null,null,null,null,null,null,null,null,null,null,null,null,null,null,null,null,null,null,null,null," "," "," "," "," "," "," "," "," "," "," ",0,0,0,0]
[null,null,null,null,null,null,null,null,null,null,null,null,null,null,null,null,null,null,null,null," "," "," "," "," "," "," "," "," "," "," ",0,0,0,0]
[null,null,null,null,null,null,null,null,null,null,null,null,null,null,null,null,null,null,null,null," "," "," "," "," "," "," "," "," "," "," ",0,0,0,0]
[null,null,null,null,null,null,null,null,null,null,null,null,null,null,null,null,null,null,null,null," "," "," "," "," "," "," "," "," "," "," ",0,0,0,0]
[null,null,null,null,null,null,null,null,null,null,null,null,null,null,null,null,null,null,null,null," "," "," "," "," "," "," "," "," "," "," ",0,0,0,0]
[null,null,null,null,null,null,null,null,null,null,null,null,null,null,null,null,null,null,null,null," "," "," "," "," "," "," "," "," "," "," ",0,0,0,0]
[null,null,null,null,null,null,null,null,null,null,null,null,null,null,null,null,null,null,null,null," "," "," "," "," "," "," "," "," "," "," ",0,0,0,0]
[null,null,null,null,null,null,null,null,null,null,null,null,null,null,null,null,null,null,null,null," "," "," "," "," "," "," "," "," "," "," ",0,0,0,0]
[null,null,null,null,null,null,null,null,null,null,null,null,null,null,null,null,null,null,null,null," "," "," "," "," "," "," "," "," "," "," ",0,0,0,0]
[null,null,null,null,null,null,null,null,null,null,null,null,null,null,null,null,null,null,null,null," "," "," "," "," "," "," "," "," "," "," ",0,0,0,0]
[null,null,null,null,null,null,null,null,null,null,null,null,null,null,null,null,null,null,null,null," "," "," "," "," "," "," "," "," "," "," ",0,0,0,0]
[null,null,null,null,null,null,null,null,null,null,null,null,null,null,null,null,null,null,null,null," "," "," "," "," "," "," "," "," "," "," ",0,0,0,0]
[null,null,null,null,null,null,null,null,null,null,null,null,null,null,null,null,null,null,null,null," "," "," "," "," "," "," "," "," "," "," ",0,0,0,0]
[null,null,null,null,null,null,null,null,null,null,null,null,null,null,null,null,null,null,null,null," "," "," "," "," "," "," "," "," "," "," ",0,0,0,0]
[null,null,null,null,null,null,null,null,null,null,null,null,null,null,null,null,null,null,null,null," "," "," "," "," "," "," "," "," "," "," ",0,0,0,0]
[null,null,null,null,null,null,null,null,null,null,null,null,null,null,null,null,null,null,null,null," "," "," "," "," "," "," "," "," "," "," ",0,0,0,0]
[null,null,null,null,null,null,null,null,null,null,null,null,null,null,null,null,null,null,null,null," "," "," "," "," "," "," "," "," "," "," ",0,0,0,0]
[null,null,null,null,null,null,null,null,null,null,null,null,null,null,null,null,null,null,null,null," "," "," "," "," "," "," "," "," "," "," ",0,0,0,0]
[null,null,null,null,null,null,null,null,null,null,null,null,null,null,null,null,null,null,null,null," "," "," "," "," "," "," "," "," "," "," ",0,0,0,0]
[null,null,null,null,null,null,null,null,null,null,null,null,null,null,null,null,null,null,null,null," "," "," "," "," "," "," "," "," "," "," ",0,0,0,0]
[null,null,null,null,null,null,null,null,null,null,null,null,null,null,null,null,null,null,null,null," "," "," "," "," "," "," "," "," "," "," ",0,0,0,0]
[null,null,null,null,null,null,null,null,null,null,null,null,null,null,null,null,null,null,null,null," "," "," "," "," "," "," "," "," "," "," ",0,0,0,0]
[null,null,null,null,null,null,null,null,null,null,null,null,null,null,null,null,null,null,null,null," "," "," "," "," "," "," "," "," "," "," ",0,0,0,0]
[null,null,null,null,null,null,null,null,null,null,null,null,null,null,null,null,null,null,null,null," "," "," "," "," "," "," "," "," "," "," ",0,0,0,0]
[null,null,null,null,null,null,null,null,null,null,null,null,null,null,null,null,null,null,null,null," "," "," "," "," "," "," "," "," "," "," ",0,0,0,0]
[null,null,null,null,null,null,null,null,null,null,null,null,null,null,null,null,null,null,null,null," "," "," "," "," "," "," "," "," "," "," ",0,0,0,0]
[null,null,null,null,null,null,null,null,null,null,null,null,null,null,null,null,null,null,null,null," "," "," "," "," "," "," "," "," "," "," ",0,0,0,0]
[null,null,null,null,null,null,null,null,null,null,null,null,null,null,null,null,null,null,null,null," "," "," "," "," "," "," "," "," "," "," ",0,0,0,0]
[null,null,null,null,null,null,null,null,null,null,null,null,null,null,null,null,null,null,null,null," "," "," "," "," "," "," "," "," "," "," ",0,0,0,0]
[null,null,null,null,null,null,null,null,null,null,null,null,null,null,null,null,null,null,null,null," "," "," "," "," "," "," "," "," "," "," ",0,0,0,0]
[null,null,null,null,null,null,null,null,null,null,null,null,null,null,null,null,null,null,null,null," "," "," "," "," "," "," "," "," "," "," ",0,0,0,0]
[null,null,null,null,null,null,null,null,null,null,null,null,null,null,null,null,null,null,null,null," "," "," "," "," "," "," "," "," "," "," ",0,0,0,0]
[null,null,null,null,null,null,null,null,null,null,null,null,null,null,null,null,null,null,null,null," "," "," "," "," "," "," "," "," "," "," ",0,0,0,0]
[null,null,null,null,null,null,null,null,null,null,null,null,null,null,null,null,null,null,null,null," "," "," "," "," "," "," "," "," "," "," ",0,0,0,0]
[null,null,null,null,null,null,null,null,null,null,null,null,null,null,null,null,null,null,null,null," "," "," "," "," "," "," "," "," "," "," ",0,0,0,0]
[null,null,null,null,null,null,null,null,null,null,null,null,null,null,null,null,null,null,null,null," "," "," "," "," "," "," "," "," "," "," ",0,0,0,0]
[null,null,null,null,null,null,null,null,null,null,null,null,null,null,null,null,null,null,null,null," "," "," "," "," "," "," "," "," "," "," ",0,0,0,0]
[null,null,null,null,null,null,null,null,null,null,null,null,null,null,null,null,null,null,null,null," "," "," "," "," "," "," "," "," "," "," ",0,0,0,0]
[null,null,null,null,null,null,null,null,null,null,null,null,null,null,null,null,null,null,null,null," "," "," "," "," "," "," "," "," "," "," ",0,0,0,0]
[null,null,null,null,null,null,null,null,null,null,null,null,null,null,null,null,null,null,null,null," "," "," "," "," "," "," "," "," "," "," ",0,0,0,0]
[null,null,null,null,null,null,null,null,null,null,null,null,null,null,null,null,null,null,null,null," "," "," "," "," "," "," "," "," "," "," ",0,0,0,0]
[null,null,null,null,null,null,null,null,null,null,null,null,null,null,null,null,null,null,null,null," "," "," "," "," "," "," "," "," "," "," ",0,0,0,0]
[null,null,null,null,null,null,null,null,null,null,null,null,null,null,null,null,null,null,null,null," "," "," "," "," "," "," "," "," "," "," ",0,0,0,0]
[null,null,null,null,null,null,null,null,null,null,null,null,null,null,null,null,null,null,null,null," "," "," "," "," "," "," "," "," "," "," ",0,0,0,0]
[null,null,null,null,null,null,null,null,null,null,null,null,null,null,null,null,null,null,null,null," "," "," "," "," "," "," "," "," "," "," ",0,0,0,0]
[null,null,null,null,null,null,null,null,null,null,null,null,null,null,null,null,null,null,null,null," "," "," "," "," "," "," "," "," "," "," ",0,0,0,0]
[null,null,null,null,null,null,null,null,null,null,null,null,null,null,null,null,null,null,null,null," "," "," "," "," "," "," "," "," "," "," ",0,0,0,0]
[null,null,null,null,null,null,null,null,null,null,null,null,null,null,null,null,null,null,null,null," "," "," "," "," "," "," "," "," "," "," ",0,0,0,0]
[null,null,null,null,null,null,null,null,null,null,null,null,null,null,null,null,null,null,null,null," "," "," "," "," "," "," "," "," "," "," ",0,0,0,0]
[null,null,null,null,null,null,null,null,null,null,null,null,null,null,null,null,null,null,null,null," "," "," "," "," "," "," "," "," "," "," ",0,0,0,0]
[null,null,null,null,null,null,null,null,null,null,null,null,null,null,null,null,null,null,null,null," "," "," "," "," "," "," "," "," "," "," ",0,0,0,0]
[null,null,null,null,null,null,null,null,null,null,null,null,null,null,null,null,null,null,null,null," "," "," "," "," "," "," "," "," "," "," ",0,0,0,0]
[null,null,null,null,null,null,null,null,null,null,null,null,null,null,null,null,null,null,null,null," "," "," "," "," "," "," "," "," "," "," ",0,0,0,0]
[null,null,null,null,null,null,null,null,null,null,null,null,null,null,null,null,null,null,null,null," "," "," "," "," "," "," "," "," "," "," ",0,0,0,0]
[null,null,null,null,null,null,null,null,null,null,null,null,null,null,null,null,null,null,null,null," "," "," "," "," "," "," "," "," "," "," ",0,0,0,0]
[null,null,null,null,null,null,null,null,null,null,null,null,null,null,null,null,null,null,null,null," "," "," "," "," "," "," "," "," "," "," ",0,0,0,0]
[null,null,null,null,null,null,null,null,null,null,null,null,null,null,null,null,null,null,null,null," "," "," "," "," "," "," "," "," "," "," ",{"$f":"IF(H790=\"\",\"0\",IF(OR(AG790>=65,AH790>=55,AI790>=65),MAX(AG790:AI790),0))*1","v":0},0,0,0]
[null,null,null,null,null,null,null,null,null,null,null,null,null,null,null,null,null,null,null,null,{"$f":"IF(H791=\"\",\" \",SEARCH(\"-\",H791))","v":" "},{"$f":"IF(H791=\"\",\" \",LEFT(H791,U791-1))","v":" "},{"$f":"IF(H791=\"\",\" \",MID(H791,U791+1,4))","v":" "},{"$f":"IF(H791=\"\",\" \",V791+W791)","v":" "},{"$f":"IF(H791=\"\",\" \",IF(X791>=4,\"OK\",\"NOT OK\"))","v":" "},{"$f":"IF(N791=\"\",\" \",SEARCH(\"-\",N791))","v":" "},{"$f":"IF(N791=\"\",\" \",LEFT(N791,Z791-1))","v":" "},{"$f":"IF(N791=\"\",\" \",MID(N791,Z791+1,4))","v":" "},{"$f":"IF(N791=\"\",\" \",AA791+AB791)","v":" "},{"$f":"IF(N791=\"\",\" \",IF(AC791>=2,\"OK\",\"NOT OK\"))","v":" "},{"$f":"IF(H791=\"\",\" \",IF(AND(Y791=\"OK\",AD791=\"OK\"),\"OYNA\",IF(Y791=AD791,\"OYNAMA\",IF(Y791=AD791,\"OYNA\",\"OYNAMA\"))))","v":" "},0,{"$f":"IF(H791=\"\",\"0\",SUBSTITUTE(I791,\".\",\",\"))*1","v":0},{"$f":"IF(H791=\"\",\"0\",SUBSTITUTE(J791,\".\",\",\"))*1","v":0},{"$f":"IF(H791=\"\",\"0\",SUBSTITUTE(K791,\".\",\",\"))*1","v":0}]
[null,null,null,null,null,null,null,null,null,null,null,null,null,null,null,null,null,null,null,null," "," "," "," "," "," "," "," "," "," "," ",0,0,0,0]
[null,null,null,null,null,null,null,null,null,null,null,null,null,null,null,null,null,null,null,null," "," "," "," "," "," "," "," "," "," "," ",0,0,0,0]
[null,null,null,null,null,null,null,null,null,null,null,null,null,null,null,null,null,null,null,null," "," "," "," "," "," "," "," "," "," "," ",0,0,0,0]
[null,null,null,null,null,null,null,null,null,null,null,null,null,null,null,null,null,null,null,null," "," "," "," "," "," "," "," "," "," "," ",0,0,0,0]
[null,null,null,null,null,null,null,null,null,null,null,null,null,null,null,null,null,null,null,null," "," "," "," "," "," "," "," "," "," "," ",0,0,0,0]
[null,null,null,null,null,null,null,null,null,null,null,null,null,null,null,null,null,null,null,null," "," "," "," "," "," "," "," "," "," "," ",0,0,0,0]
[null,null,null,null,null,null,null,null,null,null,null,null,null,null,null,null,null,null,null,null," "," "," "," "," "," "," "," "," "," "," ",0,0,0,0]
[null,null,null,null,null,null,null,null,null,null,null,null,null,null,null,null,null,null,null,null," "," "," "," "," "," "," "," "," "," "," ",0,0,0,0]
[null,null,null,null,null,null,null,null,null,null,null,null,null,null,null,null,null,null,null,null," "," "," "," "," "," "," "," "," "," "," ",0,0,0,0]
[null,null,null,null,null,null,null,null,null,null,null,null,null,null,null,null,null,null,null,null," "," "," "," "," "," "," "," "," "," "," ",0,0,0,0]
[null,null,null,null,null,null,null,null,null,null,null,null,null,null,null,null,null,null,null,null," "," "," "," "," "," "," "," "," "," "," ",0,0,0,0]
[null,null,null,null,null,null,null,null,null,null,null,null,null,null,null,null,null,null,null,null," "," "," "," "," "," "," "," "," "," "," ",0,0,0,0]
[null,null,null,null,null,null,null,null,null,null,null,null,null,null,null,null,null,null,null,null," "," "," "," "," "," "," "," "," "," "," ",0,0,0,0]
[null,null,null,null,null,null,null,null,null,null,null,null,null,null,null,null,null,null,null,null," "," "," "," "," "," "," "," "," "," "," ",0,0,0,0]
[null,null,null,null,null,null,null,null,null,null,null,null,null,null,null,null,null,null,null,null," "," "," "," "," "," "," "," "," "," "," ",0,0,0,0]
[null,null,null,null,null,null,null,null,null,null,null,null,null,null,null,null,null,null,null,null," "," "," "," "," "," "," "," "," "," "," ",0,0,0,0]
[null,null,null,null,null,null,null,null,null,null,null,null,null,null,null,null,null,null,null,null," "," "," "," "," "," "," "," "," "," "," ",0,0,0,0]
[null,null,null,null,null,null,null,null,null,null,null,null,null,null,null,null,null,null,null,null," "," "," "," "," "," "," "," "," "," "," ",0,0,0,0]
[null,null,null,null,null,null,null,null,null,null,null,null,null,null,null,null,null,null,null,null," "," "," "," "," "," "," "," "," "," "," ",0,0,0,0]
[null,null,null,null,null,null,null,null,null,null,null,null,null,null,null,null,null,null,null,null," "," "," "," "," "," "," "," "," "," "," ",0,0,0,0]
[null,null,null,null,null,null,null,null,null,null,null,null,null,null,null,null,null,null,null,null," "," "," "," "," "," "," "," "," "," "," ",0,0,0,0]
[null,null,null,null,null,null,null,null,null,null,null,null,null,null,null,null,null,null,null,null," "," "," "," "," "," "," "," "," "," "," ",0,0,0,0]
[null,null,null,null,null,null,null,null,null,null,null,null,null,null,null,null,null,null,null,null," "," "," "," "," "," "," "," "," "," "," ",0,0,0,0]
[null,null,null,null,null,null,null,null,null,null,null,null,null,null,null,null,null,null,null,null," "," "," "," "," "," "," "," "," "," "," ",0,0,0,0]
[null,null,null,null,null,null,null,null,null,null,null,null,null,null,null,null,null,null,null,null," "," "," "," "," "," "," "," "," "," "," ",0,0,0,0]
[null,null,null,null,null,null,null,null,null,null,null,null,null,null,null,null,null,null,null,null," "," "," "," "," "," "," "," "," "," "," ",0,0,0,0]
[null,null,null,null,null,null,null,null,null,null,null,null,null,null,null,null,null,null,null,null," "," "," "," "," "," "," "," "," "," "," ",0,0,0,0]
[null,null,null,null,null,null,null,null,null,null,null,null,null,null,null,null,null,null,null,null," "," "," "," "," "," "," "," "," "," "," ",0,0,0,0]
[null,null,null,null,null,null,null,null,null,null,null,null,null,null,null,null,null,null,null,null," "," "," "," "," "," "," "," "," "," "," ",0,0,0,0]
[null,null,null,null,null,null,null,null,null,null,null,null,null,null,null,null,null,null,null,null," "," "," "," "," "," "," "," "," "," "," ",0,0,0,0]
[null,null,null,null,null,null,null,null,null,null,null,null,null,null,null,null,null,null,null,null," "," "," "," "," "," "," "," "," "," "," ",0,0,0,0]
[null,null,null,null,null,null,null,null,null,null,null,null,null,null,null,null,null,null,null,null," "," "," "," "," "," "," "," "," "," "," ",0,0,0,0]
[null,null,null,null,null,null,null,null,null,null,null,null,null,null,null,null,null,null,null,null," "," "," "," "," "," "," "," "," "," "," ",0,0,0,0]
[null,null,null,null,null,null,null,null,null,null,null,null,null,null,null,null,null,null,null,null," "," "," "," "," "," "," "," "," "," "," ",0,0,0,0]
[null,null,null,null,null,null,null,null,null,null,null,null,null,null,null,null,null,null,null,null," "," "," "," "," "," "," "," "," "," "," ",0,0,0,0]
[null,null,null,null,null,null,null,null,null,null,null,null,null,null,null,null,null,null,null,null," "," "," "," "," "," "," "," "," "," "," ",0,0,0,0]
[null,null,null,null,null,null,null,null,null,null,null,null,null,null,null,null,null,null,null,null," "," "," "," "," "," "," "," "," "," "," ",0,0,0,0]
[null,null,null,null,null,null,null,null,null,null,null,null,null,null,null,null,null,null,null,null," "," "," "," "," "," "," "," "," "," "," ",0,0,0,0]
[null,null,null,null,null,null,null,null,null,null,null,null,null,null,null,null,null,null,null,null," "," "," "," "," "," "," "," "," "," "," ",0,0,0,0]
[null,null,null,null,null,null,null,null,null,null,null,null,null,null,null,null,null,null,null,null," "," "," "," "," "," "," "," "," "," "," ",0,0,0,0]
[null,null,null,null,null,null,null,null,null,null,null,null,null,null,null,null,null,null,null,null," "," "," "," "," "," "," "," "," "," "," ",0,0,0,0]
[null,null,null,null,null,null,null,null,null,null,null,null,null,null,null,null,null,null,null,null," "," "," "," "," "," "," "," "," "," "," ",0,0,0,0]
[null,null,null,null,null,null,null,null,null,null,null,null,null,null,null,null,null,null,null,null," "," "," "," "," "," "," "," "," "," "," ",0,0,0,0]
[null,null,null,null,null,null,null,null,null,null,null,null,null,null,null,null,null,null,null,null," "," "," "," "," "," "," "," "," "," "," ",0,0,0,0]
[null,null,null,null,null,null,null,null,null,null,null,null,null,null,null,null,null,null,null,null," "," "," "," "," "," "," "," "," "," "," ",0,0,0,0]
[null,null,null,null,null,null,null,null,null,null,null,null,null,null,null,null,null,null,null,null," "," "," "," "," "," "," "," "," "," "," ",0,0,0,0]
[null,null,null,null,null,null,null,null,null,null,null,null,null,null,null,null,null,null,null,null," "," "," "," "," "," "," "," "," "," "," ",0,0,0,0]
[null,null,null,null,null,null,null,null,null,null,null,null,null,null,null,null,null,null,null,null," "," "," "," "," "," "," "," "," "," "," ",0,0,0,0]
[null,null,null,null,null,null,null,null,null,null,null,null,null,null,null,null,null,null,null,null," "," "," "," "," "," "," "," "," "," "," ",0,0,0,0]
[null,null,null,null,null,null,null,null,null,null,null,null,null,null,null,null,null,null,null,null," "," "," "," "," "," "," "," "," "," "," ",0,0,0,0]
[null,null,null,null,null,null,null,null,null,null,null,null,null,null,null,null,null,null,null,null," "," "," "," "," "," "," "," "," "," "," ",0,0,0,0]
[null,null,null,null,null,null,null,null,null,null,null,null,null,null,null,null,null,null,null,null," "," "," "," "," "," "," "," "," "," "," ",0,0,0,0]
[null,null,null,null,null,null,null,null,null,null,null,null,null,null,null,null,null,null,null,null," "," "," "," "," "," "," "," "," "," "," ",0,0,0,0]
[null,null,null,null,null,null,null,null,null,null,null,null,null,null,null,null,null,null,null,null," "," "," "," "," "," "," "," "," "," "," ",0,0,0,0]
[null,null,null,null,null,null,null,null,null,null,null,null,null,null,null,null,null,null,null,null," "," "," "," "," "," "," "," "," "," "," ",0,0,0,0]
[null,null,null,null,null,null,null,null,null,null,null,null,null,null,null,null,null,null,null,null," "," "," "," "," "," "," "," "," "," "," ",0,0,0,0]
[null,null,null,null,null,null,null,null,null,null,null,null,null,null,null,null,null,null,null,null," "," "," "," "," "," "," "," "," "," "," ",0,0,0,0]
[null,null,null,null,null,null,null,null,null,null,null,null,null,null,null,null,null,null,null,null," "," "," "," "," "," "," "," "," "," "," ",0,0,0,0]
[null,null,null,null,null,null,null,null,null,null,null,null,null,null,null,null,null,null,null,null," "," "," "," "," "," "," "," "," "," "," ",0,0,0,0]
[null,null,null,null,null,null,null,null,null,null,null,null,null,null,null,null,null,null,null,null," "," "," "," "," "," "," "," "," "," "," ",0,0,0,0]
[null,null,null,null,null,null,null,null,null,null,null,null,null,null,null,null,null,null,null,null," "," "," "," "," "," "," "," "," "," "," ",0,0,0,0]
[null,null,null,null,null,null,null,null,null,null,null,null,null,null,null,null,null,null,null,null," "," "," "," "," "," "," "," "," "," "," ",0,0,0,0]
[null,null,null,null,null,null,null,null,null,null,null,null,null,null,null,null,null,null,null,null," "," "," "," "," "," "," "," "," "," "," ",{"$f":"IF(H854=\"\",\"0\",IF(OR(AG854>=65,AH854>=55,AI854>=65),MAX(AG854:AI854),0))*1","v":0},0,0,0]
[null,null,null,null,null,null,null,null,null,null,null,null,null,null,null,null,null,null,null,null,{"$f":"IF(H855=\"\",\" \",SEARCH(\"-\",H855))","v":" "},{"$f":"IF(H855=\"\",\" \",LEFT(H855,U855-1))","v":" "},{"$f":"IF(H855=\"\",\" \",MID(H855,U855+1,4))","v":" "},{"$f":"IF(H855=\"\",\" \",V855+W855)","v":" "},{"$f":"IF(H855=\"\",\" \",IF(X855>=4,\"OK\",\"NOT OK\"))","v":" "},{"$f":"IF(N855=\"\",\" \",SEARCH(\"-\",N855))","v":" "},{"$f":"IF(N855=\"\",\" \",LEFT(N855,Z855-1))","v":" "},{"$f":"IF(N855=\"\",\" \",MID(N855,Z855+1,4))","v":" "},{"$f":"IF(N855=\"\",\" \",AA855+AB855)","v":" "},{"$f":"IF(N855=\"\",\" \",IF(AC855>=2,\"OK\",\"NOT OK\"))","v":" "},{"$f":"IF(H855=\"\",\" \",IF(AND(Y855=\"OK\",AD855=\"OK\"),\"OYNA\",IF(Y855=AD855,\"OYNAMA\",IF(Y855=AD855,\"OYNA\",\"OYNAMA\"))))","v":" "},0,{"$f":"IF(H855=\"\",\"0\",SUBSTITUTE(I855,\".\",\",\"))*1","v":0},{"$f":"IF(H855=\"\",\"0\",SUBSTITUTE(J855,\".\",\",\"))*1","v":0},{"$f":"IF(H855=\"\",\"0\",SUBSTITUTE(K855,\".\",\",\"))*1","v":0}]
[null,null,null,null,null,null,null,null,null,null,null,null,null,null,null,null,null,null,null,null," "," "," "," "," "," "," "," "," "," "," ",0,0,0,0]
[null,null,null,null,null,null,null,null,null,null,null,null,null,null,null,null,null,null,null,null," "," "," "," "," "," "," "," "," "," "," ",0,0,0,0]
[null,null,null,null,null,null,null,null,null,null,null,null,null,null,null,null,null,null,null,null," "," "," "," "," "," "," "," "," "," "," ",0,0,0,0]
[null,null,null,null,null,null,null,null,null,null,null,null,null,null,null,null,null,null,null,null," "," "," "," "," "," "," "," "," "," "," ",0,0,0,0]
[null,null,null,null,null,null,null,null,null,null,null,null,null,null,null,null,null,null,null,null," "," "," "," "," "," "," "," "," "," "," ",0,0,0,0]
[null,null,null,null,null,null,null,null,null,null,null,null,null,null,null,null,null,null,null,null," "," "," "," "," "," "," "," "," "," "," ",0,0,0,0]
[null,null,null,null,null,null,null,null,null,null,null,null,null,null,null,null,null,null,null,null," "," "," "," "," "," "," "," "," "," "," ",0,0,0,0]
[null,null,null,null,null,null,null,null,null,null,null,null,null,null,null,null,null,null,null,null," "," "," "," "," "," "," "," "," "," "," ",0,0,0,0]
[null,null,null,null,null,null,null,null,null,null,null,null,null,null,null,null,null,null,null,null," "," "," "," "," "," "," "," "," "," "," ",0,0,0,0]
[null,null,null,null,null,null,null,null,null,null,null,null,null,null,null,null,null,null,null,null," "," "," "," "," "," "," "," "," "," "," ",0,0,0,0]
[null,null,null,null,null,null,null,null,null,null,null,null,null,null,null,null,null,null,null,null," "," "," "," "," "," "," "," "," "," "," ",0,0,0,0]
[null,null,null,null,null,null,null,null,null,null,null,null,null,null,null,null,null,null,null,null," "," "," "," "," "," "," "," "," "," "," ",0,0,0,0]
[null,null,null,null,null,null,null,null,null,null,null,null,null,null,null,null,null,null,null,null," "," "," "," "," "," "," "," "," "," "," ",0,0,0,0]
[null,null,null,null,null,null,null,null,null,null,null,null,null,null,null,null,null,null,null,null," "," "," "," "," "," "," "," "," "," "," ",0,0,0,0]
[null,null,null,null,null,null,null,null,null,null,null,null,null,null,null,null,null,null,null,null," "," "," "," "," "," "," "," "," "," "," ",0,0,0,0]
[null,null,null,null,null,null,null,null,null,null,null,null,null,null,null,null,null,null,null,null," "," "," "," "," "," "," "," "," "," "," ",0,0,0,0]
[null,null,null,null,null,null,null,null,null,null,null,null,null,null,null,null,null,null,null,null," "," "," "," "," "," "," "," "," "," "," ",0,0,0,0]
[null,null,null,null,null,null,null,null,null,null,null,null,null,null,null,null,null,null,null,null," "," "," "," "," "," "," "," "," "," "," ",0,0,0,0]
[null,null,null,null,null,null,null,null,null,null,null,null,null,null,null,null,null,null,null,null," "," "," "," "," "," "," "," "," "," "," ",0,0,0,0]
[null,null,null,null,null,null,null,null,null,null,null,null,null,null,null,null,null,null,null,null," "," "," "," "," "," "," "," "," "," "," ",0,0,0,0]
[null,null,null,null,null,null,null,null,null,null,null,null,null,null,null,null,null,null,null,null," "," "," "," "," "," "," "," "," "," "," ",0,0,0,0]
[null,null,null,null,null,null,null,null,null,null,null,null,null,null,null,null,null,null,null,null," "," "," "," "," "," "," "," "," "," "," ",0,0,0,0]
[null,null,null,null,null,null,null,null,null,null,null,null,null,null,null,null,null,null,null,null," "," "," "," "," "," "," "," "," "," "," ",0,0,0,0]
[null,null,null,null,null,null,null,null,null,null,null,null,null,null,null,null,null,null,null,null," "," "," "," "," "," "," "," "," "," "," ",0,0,0,0]
[null,null,null,null,null,null,null,null,null,null,null,null,null,null,null,null,null,null,null,null," "," "," "," "," "," "," "," "," "," "," ",0,0,0,0]
[null,null,null,null,null,null,null,null,null,null,null,null,null,null,null,null,null,null,null,null," "," "," "," "," "," "," "," "," "," "," ",0,0,0,0]
[null,null,null,null,null,null,null,null,null,null,null,null,null,null,null,null,null,null,null,null," "," "," "," "," "," "," "," "," "," "," ",0,0,0,0]
[null,null,null,null,null,null,null,null,null,null,null,null,null,null,null,null,null,null,null,null," "," "," "," "," "," "," "," "," "," "," ",0,0,0,0]
[null,null,null,null,null,null,null,null,null,null,null,null,null,null,null,null,null,null,null,null," "," "," "," "," "," "," "," "," "," "," ",0,0,0,0]
[null,null,null,null,null,null,null,null,null,null,null,null,null,null,null,null,null,null,null,null," "," "," "," "," "," "," "," "," "," "," ",0,0,0,0]
[null,null,null,null,null,null,null,null,null,null,null,null,null,null,null,null,null,null,null,null," "," "," "," "," "," "," "," "," "," "," ",0,0,0,0]
[null,null,null,null,null,null,null,null,null,null,null,null,null,null,null,null,null,null,null,null," "," "," "," "," "," "," "," "," "," "," ",0,0,0,0]
[null,null,null,null,null,null,null,null,null,null,null,null,null,null,null,null,null,null,null,null," "," "," "," "," "," "," "," "," "," "," ",0,0,0,0]
[null,null,null,null,null,null,null,null,null,null,null,null,null,null,null,null,null,null,null,null," "," "," "," "," "," "," "," "," "," "," ",0,0,0,0]
[null,null,null,null,null,null,null,null,null,null,null,null,null,null,null,null,null,null,null,null," "," "," "," "," "," "," "," "," "," "," ",0,0,0,0]
[null,null,null,null,null,null,null,null,null,null,null,null,null,null,null,null,null,null,null,null," "," "," "," "," "," "," "," "," "," "," ",0,0,0,0]
[null,null,null,null,null,null,null,null,null,null,null,null,null,null,null,null,null,null,null,null," "," "," "," "," "," "," "," "," "," "," ",0,0,0,0]
[null,null,null,null,null,null,null,null,null,null,null,null,null,null,null,null,null,null,null,null," "," "," "," "," "," "," "," "," "," "," ",0,0,0,0]
[null,null,null,null,null,null,null,null,null,null,null,null,null,null,null,null,null,null,null,null," "," "," "," "," "," "," "," "," "," "," ",0,0,0,0]
[null,null,null,null,null,null,null,null,null,null,null,null,null,null,null,null,null,null,null,null," "," "," "," "," "," "," "," "," "," "," ",0,0,0,0]
[null,null,null,null,null,null,null,null,null,null,null,null,null,null,null,null,null,null,null,null," "," "," "," "," "," "," "," "," "," "," ",0,0,0,0]
[null,null,null,null,null,null,null,null,null,null,null,null,null,null,null,null,null,null,null,null," "," "," "," "," "," "," "," "," "," "," ",0,0,0,0]
[null,null,null,null,null,null,null,null,null,null,null,null,null,null,null,null,null,null,null,null," "," "," "," "," "," "," "," "," "," "," ",0,0,0,0]
[null,null,null,null,null,null,null,null,null,null,null,null,null,null,null,null,null,null,null,null," "," "," "," "," "," "," "," "," "," "," ",0,0,0,0]
[null,null,null,null,null,null,null,null,null,null,null,null,null,null,null,null,null,null,null,null," "," "," "," "," "," "," "," "," "," "," ",0,0,0,0]
[null,null,null,null,null,null,null,null,null,null,null,null,null,null,null,null,null,null,null,null," "," "," "," "," "," "," "," "," "," "," ",0,0,0,0]
[null,null,null,null,null,null,null,null,null,null,null,null,null,null,null,null,null,null,null,null," "," "," "," "," "," "," "," "," "," "," ",0,0,0,0]
[null,null,null,null,null,null,null,null,null,null,null,null,null,null,null,null,null,null,null,null," "," "," "," "," "," "," "," "," "," "," ",0,0,0,0]
[null,null,null,null,null,null,null,null,null,null,null,null,null,null,null,null,null,null,null,null," "," "," "," "," "," "," "," "," "," "," ",0,0,0,0]
[null,null,null,null,null,null,null,null,null,null,null,null,null,null,null,null,null,null,null,null," "," "," "," "," "," "," "," "," "," "," ",0,0,0,0]
[null,null,null,null,null,null,null,null,null,null,null,null,null,null,null,null,null,null,null,null," "," "," "," "," "," "," "," "," "," "," ",0,0,0,0]
[null,null,null,null,null,null,null,null,null,null,null,null,null,null,null,null,null,null,null,null," "," "," "," "," "," "," "," "," "," "," ",0,0,0,0]
[null,null,null,null,null,null,null,null,null,null,null,null,null,null,null,null,null,null,null,null," "," "," "," "," "," "," "," "," "," "," ",0,0,0,0]
[null,null,null,null,null,null,null,null,null,null,null,null,null,null,null,null,null,null,null,null," "," "," "," "," "," "," "," "," "," "," ",0,0,0,0]
[null,null,null,null,null,null,null,null,null,null,null,null,null,null,null,null,null,null,null,null," "," "," "," "," "," "," "," "," "," "," ",0,0,0,0]
[null,null,null,null,null,null,null,null,null,null,null,null,null,null,null,null,null,null,null,null," "," "," "," "," "," "," "," "," "," "," ",0,0,0,0]
[null,null,null,null,null,null,null,null,null,null,null,null,null,null,null,null,null,null,null,null," "," "," "," "," "," "," "," "," "," "," ",0,0,0,0]
[null,null,null,null,null,null,null,null,null,null,null,null,null,null,null,null,null,null,null,null," "," "," "," "," "," "," "," "," "," "," ",0,0,0,0]
[null,null,null,null,null,null,null,null,null,null,null,null,null,null,null,null,null,null,null,null," "," "," "," "," "," "," "," "," "," "," ",0,0,0,0]
[null,null,null,null,null,null,null,null,null,null,null,null,null,null,null,null,null,null,null,null," "," "," "," "," "," "," "," "," "," "," ",0,0,0,0]
[null,null,null,null,null,null,null,null,null,null,null,null,null,null,null,null,null,null,null,null," "," "," "," "," "," "," "," "," "," "," ",0,0,0,0]
[null,null,null,null,null,null,null,null,null,null,null,null,null,null,null,null,null,null,null,null," "," "," "," "," "," "," "," "," "," "," ",0,0,0,0]
[null,null,null,null,null,null,null,null,null,null,null,null,null,null,null,null,null,null,null,null," "," "," "," "," "," "," "," "," "," "," ",{"$f":"IF(H918=\"\",\"0\",IF(OR(AG918>=65,AH918>=55,AI918>=65),MAX(AG918:AI918),0))*1","v":0},0,0,0]
[null,null,null,null,null,null,null,null,null,null,null,null,null,null,null,null,null,null,null,null,{"$f":"IF(H919=\"\",\" \",SEARCH(\"-\",H919))","v":" "},{"$f":"IF(H919=\"\",\" \",LEFT(H919,U919-1))","v":" "},{"$f":"IF(H919=\"\",\" \",MID(H919,U919+1,4))","v":" "},{"$f":"IF(H919=\"\",\" \",V919+W919)","v":" "},{"$f":"IF(H919=\"\",\" \",IF(X919>=4,\"OK\",\"NOT OK\"))","v":" "},{"$f":"IF(N919=\"\",\" \",SEARCH(\"-\",N919))","v":" "},{"$f":"IF(N919=\"\",\" \",LEFT(N919,Z919-1))","v":" "},{"$f":"IF(N919=\"\",\" \",MID(N919,Z919+1,4))","v":" "},{"$f":"IF(N919=\"\",\" \",AA919+AB919)","v":" "},{"$f":"IF(N919=\"\",\" \",IF(AC919>=2,\"OK\",\"NOT OK\"))","v":" "},{"$f":"IF(H919=\"\",\" \",IF(AND(Y919=\"OK\",AD919=\"OK\"),\"OYNA\",IF(Y919=AD919,\"OYNAMA\",IF(Y919=AD919,\"OYNA\",\"OYNAMA\"))))","v":" "},0,{"$f":"IF(H919=\"\",\"0\",SUBSTITUTE(I919,\".\",\",\"))*1","v":0},{"$f":"IF(H919=\"\",\"0\",SUBSTITUTE(J919,\".\",\",\"))*1","v":0},{"$f":"IF(H919=\"\",\"0\",SUBSTITUTE(K919,\".\",\",\"))*1","v":0}]
[null,null,null,null,null,null,null,null,null,null,null,null,null,null,null,null,null,null,null,null," "," "," "," "," "," "," "," "," "," "," ",0,0,0,0]
[null,null,null,null,null,null,null,null,null,null,null,null,null,null,null,null,null,null,null,null," "," "," "," "," "," "," "," "," "," "," ",0,0,0,0]
[null,null,null,null,null,null,null,null,null,null,null,null,null,null,null,null,null,null,null,null," "," "," "," "," "," "," "," "," "," "," ",0,0,0,0]
[null,null,null,null,null,null,null,null,null,null,null,null,null,null,null,null,null,null,null,null," "," "," "," "," "," "," "," "," "," "," ",0,0,0,0]
[null,null,null,null,null,null,null,null,null,null,null,null,null,null,null,null,null,null,null,null," "," "," "," "," "," "," "," "," "," "," ",0,0,0,0]
[null,null,null,null,null,null,null,null,null,null,null,null,null,null,null,null,null,null,null,null," "," "," "," "," "," "," "," "," "," "," ",0,0,0,0]
[null,null,null,null,null,null,null,null,null,null,null,null,null,null,null,null,null,null,null,null," "," "," "," "," "," "," "," "," "," "," ",0,0,0,0]
[null,null,null,null,null,null,null,null,null,null,null,null,null,null,null,null,null,null,null,null," "," "," "," "," "," "," "," "," "," "," ",0,0,0,0]
[null,null,null,null,null,null,null,null,null,null,null,null,null,null,null,null,null,null,null,null," "," "," "," "," "," "," "," "," "," "," ",0,0,0,0]
[null,null,null,null,null,null,null,null,null,null,null,null,null,null,null,null,null,null,null,null," "," "," "," "," "," "," "," "," "," "," ",0,0,0,0]
[null,null,null,null,null,null,null,null,null,null,null,null,null,null,null,null,null,null,null,null," "," "," "," "," "," "," "," "," "," "," ",0,0,0,0]
[null,null,null,null,null,null,null,null,null,null,null,null,null,null,null,null,null,null,null,null," "," "," "," "," "," "," "," "," "," "," ",0,0,0,0]
[null,null,null,null,null,null,null,null,null,null,null,null,null,null,null,null,null,null,null,null," "," "," "," "," "," "," "," "," "," "," ",0,0,0,0]
[null,null,null,null,null,null,null,null,null,null,null,null,null,null,null,null,null,null,null,null," "," "," "," "," "," "," "," "," "," "," ",0,0,0,0]
[null,null,null,null,null,null,null,null,null,null,null,null,null,null,null,null,null,null,null,null," "," "," "," "," "," "," "," "," "," "," ",0,0,0,0]
[null,null,null,null,null,null,null,null,null,null,null,null,null,null,null,null,null,null,null,null," "," "," "," "," "," "," "," "," "," "," ",0,0,0,0]
[null,null,null,null,null,null,null,null,null,null,null,null,null,null,null,null,null,null,null,null," "," "," "," "," "," "," "," "," "," "," ",0,0,0,0]
[null,null,null,null,null,null,null,null,null,null,null,null,null,null,null,null,null,null,null,null," "," "," "," "," "," "," "," "," "," "," ",0,0,0,0]
[null,null,null,null,null,null,null,null,null,null,null,null,null,null,null,null,null,null,null,null," "," "," "," "," "," "," "," "," "," "," ",0,0,0,0]
[null,null,null,null,null,null,null,null,null,null,null,null,null,null,null,null,null,null,null,null," "," "," "," "," "," "," "," "," "," "," ",0,0,0,0]
[null,null,null,null,null,null,null,null,null,null,null,null,null,null,null,null,null,null,null,null," "," "," "," "," "," "," "," "," "," "," ",0,0,0,0]
[null,null,null,null,null,null,null,null,null,null,null,null,null,null,null,null,null,null,null,null," "," "," "," "," "," "," "," "," "," "," ",0,0,0,0]
[null,null,null,null,null,null,null,null,null,null,null,null,null,null,null,null,null,null,null,null," "," "," "," "," "," "," "," "," "," "," ",0,0,0,0]
[null,null,null,null,null,null,null,null,null,null,null,null,null,null,null,null,null,null,null,null," "," "," "," "," "," "," "," "," "," "," ",0,0,0,0]
[null,null,null,null,null,null,null,null,null,null,null,null,null,null,null,null,null,null,null,null," "," "," "," "," "," "," "," "," "," "," ",0,0,0,0]
[null,null,null,null,null,null,null,null,null,null,null,null,null,null,null,null,null,null,null,null," "," "," "," "," "," "," "," "," "," "," ",0,0,0,0]
[null,null,null,null,null,null,null,null,null,null,null,null,null,null,null,null,null,null,null,null," "," "," "," "," "," "," "," "," "," "," ",0,0,0,0]
[null,null,null,null,null,null,null,null,null,null,null,null,null,null,null,null,null,null,null,null," "," "," "," "," "," "," "," "," "," "," ",0,0,0,0]
[null,null,null,null,null,null,null,null,null,null,null,null,null,null,null,null,null,null,null,null," "," "," "," "," "," "," "," "," "," "," ",0,0,0,0]
[null,null,null,null,null,null,null,null,null,null,null,null,null,null,null,null,null,null,null,null," "," "," "," "," "," "," "," "," "," "," ",0,0,0,0]
[null,null,null,null,null,null,null,null,null,null,null,null,null,null,null,null,null,null,null,null," "," "," "," "," "," "," "," "," "," "," ",0,0,0,0]
[null,null,null,null,null,null,null,null,null,null,null,null,null,null,null,null,null,null,null,null," "," "," "," "," "," "," "," "," "," "," ",0,0,0,0]
[null,null,null,null,null,null,null,null,null,null,null,null,null,null,null,null,null,null,null,null," "," "," "," "," "," "," "," "," "," "," ",0,0,0,0]
[null,null,null,null,null,null,null,null,null,null,null,null,null,null,null,null,null,null,null,null," "," "," "," "," "," "," "," "," "," "," ",0,0,0,0]
[null,null,null,null,null,null,null,null,null,null,null,null,null,null,null,null,null,null,null,null," "," "," "," "," "," "," "," "," "," "," ",0,0,0,0]
[null,null,null,null,null,null,null,null,null,null,null,null,null,null,null,null,null,null,null,null," "," "," "," "," "," "," "," "," "," "," ",0,0,0,0]
[null,null,null,null,null,null,null,null,null,null,null,null,null,null,null,null,null,null,null,null," "," "," "," "," "," "," "," "," "," "," ",0,0,0,0]
[null,null,null,null,null,null,null,null,null,null,null,null,null,null,null,null,null,null,null,null," "," "," "," "," "," "," "," "," "," "," ",0,0,0,0]
[null,null,null,null,null,null,null,null,null,null,null,null,null,null,null,null,null,null,null,null," "," "," "," "," "," "," "," "," "," "," ",0,0,0,0]
[null,null,null,null,null,null,null,null,null,null,null,null,null,null,null,null,null,null,null,null," "," "," "," "," "," "," "," "," "," "," ",0,0,0,0]
[null,null,null,null,null,null,null,null,null,null,null,null,null,null,null,null,null,null,null,null," "," "," "," "," "," "," "," "," "," "," ",0,0,0,0]
[null,null,null,null,null,null,null,null,null,null,null,null,null,null,null,null,null,null,null,null," "," "," "," "," "," "," "," "," "," "," ",0,0,0,0]
[null,null,null,null,null,null,null,null,null,null,null,null,null,null,null,null,null,null,null,null," "," "," "," "," "," "," "," "," "," "," ",0,0,0,0]
[null,null,null,null,null,null,null,null,null,null,null,null,null,null,null,null,null,null,null,null," "," "," "," "," "," "," "," "," "," "," ",0,0,0,0]
[null,null,null,null,null,null,null,null,null,null,null,null,null,null,null,null,null,null,null,null," "," "," "," "," "," "," "," "," "," "," ",0,0,0,0]
[null,null,null,null,null,null,null,null,null,null,null,null,null,null,null,null,null,null,null,null," "," "," "," "," "," "," "," "," "," "," ",0,0,0,0]
[null,null,null,null,null,null,null,null,null,null,null,null,null,null,null,null,null,null,null,null," "," "," "," "," "," "," "," "," "," "," ",0,0,0,0]
[null,null,null,null,null,null,null,null,null,null,null,null,null,null,null,null,null,null,null,null," "," "," "," "," "," "," "," "," "," "," ",0,0,0,0]
[null,null,null,null,null,null,null,null,null,null,null,null,null,null,null,null,null,null,null,null," "," "," "," "," "," "," "," "," "," "," ",0,0,0,0]
[null,null,null,null,null,null,null,null,null,null,null,null,null,null,null,null,null,null,null,null," "," "," "," "," "," "," "," "," "," "," ",0,0,0,0]
[null,null,null,null,null,null,null,null,null,null,null,null,null,null,null,null,null,null,null,null," "," "," "," "," "," "," "," "," "," "," ",0,0,0,0]
[null,null,null,null,null,null,null,null,null,null,null,null,null,null,null,null,null,null,null,null," "," "," "," "," "," "," "," "," "," "," ",0,0,0,0]
[null,null,null,null,null,null,null,null,null,null,null,null,null,null,null,null,null,null,null,null," "," "," "," "," "," "," "," "," "," "," ",0,0,0,0]

{"sheet":"Veri2","index":2,"n_rows":217,"n_cols":61,"rows_kept":217,"cut":false,"hidden":false,"merged":[[73,45,73,47],[113,45,113,47],[74,50,74,57],[94,50,94,57],[114,50,114,57],[148,50,148,57],[74,36,74,43],[94,36,94,43],[114,36,114,43],[148,36,148,43]]}
[]
[]
[]
["Skip Navigation Links"]
[]
["Betistuta"]
["Futbol"]
["Basketbol"]
["Voleybol"]
["Hentbol"]
["BuzHokeyi"]
["Beyzbol"]
["Tenis"]
["BOYZ(F)"]
["BOYZ(B)"]
["Orandelli"]
["Gol Oldu mu ?"]
["Iletisim"]
[" ",null," "]
[]
["Lambton Jaffas"]
[]
[]
[]
["Takım Gücü  "]
["IY/MS"]
["14.6 /27.9"]
["Sonraki Maç"]
[]
[]
[]
["Avustralya-Ulusal Premier Lig Kuzey YGG"]
["11.06.2022  / 07:30"]
["Iddaa Kodu : 771301"]
[" ",0.01,0,"%2"]
["IY","46.7","2022-01-31","2022-02-22"]
["MS","45.1","2022-05-31","2022-04-23"]
[]
["Beklenen Skor (IY/MS)"]
["1-0 /2 - 1"]
["Maç Sonucu (IY/MS)",null,null,null,null,null,null,null,null,null,null,null,null,null,null,null,null,null,null,null,null,null,null,null,null,null,null,null,null,null,null,null,null,null,null,null,null,null,null,null,null,null,null,null,null,null,null,null,null,null,null,null,null,null,null,null,null,null,null,-15,"2.5 GOL ÜST"]
["2-0 /3 - 0",null,null,null,null,null,null,null,null,null,null,null,null,null,null,null,null,null,null,null,null,null,null,null,null,null,null,null,null,null,null,null,null,null,null,null,null,null,null,null,null,null,null,null,null,null,null,null,null,null,null,null,null,null,null,null,null,null,null,-14,"2.5 GOL ÜST"]
[null,null,null,null,null,null,null,null,null,null,null,null,null,null,null,null,null,null,null,null,null,null,null,null,null,null,null,null,null,null,null,null,null,null,null,null,null,null,null,null,null,null,null,null,null,null,null,null,null,null,null,null,null,null,null,null,null,null,null,null,"2.5 GOL ÜST"]
["  ",null,null,null,null,null,null,null,null,null,null,null,null,null,null,null,null,null,null,null,null,null,null,null,null,null,null,null,null,null,null,null,null,null,null,null,null,null,null,null,null,null,null,null,null,null,null,null,null,null,null,null,null,null,null,null,null,null,null,null,"2.5 GOL ÜST"]
[null,null,null,null,null,null,null,null,null,null,null,null,null,null,null,null,null,null,null,null,null,null,null,null,null,null,null,null,null,null,null,null,null,null,null,null,null,null,null,null,null,null,null,null,null,null,null,null,null,null,null,null,null,null,null,null,null,null,null,-13,"2.5 GOL ÜST"]
["Edgeworth Eagles",null,null,null,null,null,null,null,null,null,null,null,null,null,null,null,null,null,null,null,null,null,null,null,null,null,null,null,null,null,null,null,null,null,null,null,null,null,null,null,null,null,null,null,null,null,null,null,null,null,null,null,null,null,null,null,null,null,null,-12,"2.5 GOL ÜST"]
[]
[]
[]
["Takım Gücü  "]
["IY/MS"]
["6.9 /14.5"]
["Sonraki Maç"]
[]
[]
[]
[" ",null," "]
["#iddaa","MS1","MS0","MS2"," ","IY1","IY0","IY2"," "]
[" ","1968-01-01","2025-03-01","3.15"," ","-","-","-"," "]
[" ","HMS1","HMS0","HMS2"," ","CS10","CS12","CS02"," "]
[" ",null,null,null," ","1.11","2022-10-01","1956-01-01"," "]
["TG01","TG23","TG45","TG6+","KG Y/V","IY1.5 A/U","1.5 A/U","2.5 A/U","3.5 A/U"]
["1965-04-01","1995-01-01","1985-02-01","8.00","2.14 /1.34","- /-","- /-","2.10 /1.36","1.38 /2.05"]
["2022-01-01","0/1","2022-01-02","1/0","0/0","2/0","2022-02-01","0/2","2022-02-02"]
["-","-","-","-","-","-","-","-","-"]
["#boyz","MS1","MS0","MS2"," ","IY1","IY0","IY2",28]
[" ",54,11,"36"," ","46",36,18," "]
[" ","HMS1","HMS0","HMS2"," ","CS10","CS12","CS02"," "]
[" ",21,32,"46"," ","64",89,46," "]
["TG01","TG23","TG46","TG7+","KGV","IY1.5","U1.5","U2.5","U3.5"]
[11,57,21,"11",68,"46",89,71,32]
["2022-01-01","0/1","2022-01-02","1/0","0/0","2/0","2022-02-01","0/2","2022-02-02"]
[36,18,0,"4",7,"0",7,11,18]
[null,null,null,null,null,null,null,null,null,null,null,null,null,null,null,null,null,null,null,null,null,null,null,null,null,null,null,null,null,null,null,null,null,null,null,null,null,null,null,null,null,null,null,null,{"$f":"ROUND(SUM(AS93+AT93+AU93+AV93-(AS113+AT113+AU113+AV113)),0)","v":2},{"$f":"VLOOKUP(AS74,BH41:BI100,2,FALSE)","v":"MOST'A GÖRE RİSKLİ"},null,null,null,null,null,null,null,null,null,null,null,null,null,-11,"2.5 GOL ÜST"]
[" ","Tarih","EvSahibi","MS","Deplasman","İY",null,null,null,null,null,null,null,null,null,null,null,null,null,null,null,null,null,null,null,null,null,null,null,null,null,null,null,null,null,{"$f":"A21","v":"Lambton Jaffas"},"MS",null,null,null,null,null,null,null,"2.5 Ü","KG","2.5 A","KGY2.5A",null,{"$f":"AJ75","v":"Lambton Jaffas"},"İY",null,null,null,null,null,null,null,null,-10,"2.5 GOL ÜST"]
["D","2022-06-04","Lambton Jaffas","1 - 1","Weston Bears","1-0",null,null,null,null,null,null,null,null,null,null,null,null,null,null,null,null,null,null,null,null,null,null,null,null,null,null,null,null,null,null,{"$f":"IFERROR(IF(D76=\"\",\"0\",IFERROR(VALUE(TRIM(MID(D76,1,IFERROR(FIND(\"-\",D76,1),FIND(\"-\",D76,1))-1))),\"\")),\"\")","v":1},{"$f":"IFERROR(IF(D76=\"\",\"0\",IFERROR(VALUE(TRIM(MID(D76,IFERROR(FIND(\"-\",D76,1),FIND(\"-\",D76,1))+1,500))),\"\")),\"\")","v":1},{"$f":"IFERROR(IF(OR(AK76=\"\",AL76=\"\"),\"\",IF(C76=$AJ$75,AK76,AL76)),\"\")","v":1},{"$f":"IFERROR(IF(OR(AK76=\"\",AL76=\"\"),\"\",IF(C76=$AJ$75,AL76,AK76)),\"\")","v":1},{"$f":"IFERROR(AM76+AN76,\"\")","v":2},{"$f":"IFERROR(IF(OR(AM76=\"\",AN76=\"\"),\"\",IF(AM76>AN76,3,IF(AM76<AN76,0,1))),\"\")","v":1},{"$f":"IFERROR(IF(AP76=\"\",\"\",IF(AP76=1,\"D\",IF(AP76=0,\"L\",IF(AP76=3,\"W\")))),\"\")","v":"D"},{"$f":"IFERROR(IF(AM76>AN76,18,IF(AM76=AN76,6,0)),\"\")","v":6},{"$f":"IF(AO76>=3,1,0)","v":0},{"$f":"IF((IF((IF(AM76>=1,1,0))>=1,1,0)+IF((IF(AN76>=1,1,0))>=1,1,0))>=2,1,0)","v":1},{"$f":"IF(AO76>=3,1,0)","v":0},{"$f":"((IF(AM76>=1,0,-0.75))+(IF(AN76>=1,0,-0.75))+IF(AO76<3,-0.75,0))","v":-0.75},null,null,{"$f":"IFERROR(IF(F76=\"\",\"0\",IFERROR(VALUE(TRIM(MID(F76,1,IFERROR(FIND(\"-\",F76,1),FIND(\"-\",F76,1))-1))),\"\")),\"\")","v":1},{"$f":"IFERROR(IF(F76=\"\",\"0\",IFERROR(VALUE(TRIM(MID(F76,IFERROR(FIND(\"-\",F76,1),FIND(\"-\",F76,1))+1,500))),\"\")),\"\")","v":0},{"$f":"IFERROR(IF(OR(AY76=\"\",AZ76=\"\"),\"\",IF(C76=$AJ$75,AY76,AZ76)),\"\")","v":1},{"$f":"IFERROR(IF(OR(AY76=\"\",AZ76=\"\"),\"\",IF(C76=$AJ$75,AZ76,AY76)),\"\")","v":0},{"$f":"IFERROR(BA76+BB76,\"\")","v":1},{"$f":"IFERROR(IF(OR(BA76=\"\",BB76=\"\"),\"\",IF(BA76>BB76,3,IF(BA76<BB76,0,1))),\"\")","v":3},{"$f":"IFERROR(IF(BD76=\"\",\"\",IF(BD76=1,\"D\",IF(BD76=0,\"L\",IF(BD76=3,\"W\")))),\"\")","v":"W"},{"$f":"IFERROR(IF(BA76>BB76,18,IF(BA76=BB76,6,0)),\"\")","v":18},null,-9,"2.5 GOL ÜST"]
["D","2022-06-01","Adamstown Rosebuds","1 - 2","Lambton Jaffas","1-2",null,null,null,null,null,null,null,null,null,null,null,null,null,null,null,null,null,null,null,null,null,null,null,null,null,null,null,null,null,null,{"$f":"IFERROR(IF(D77=\"\",\"0\",IFERROR(VALUE(TRIM(MID(D77,1,IFERROR(FIND(\"-\",D77,1),FIND(\"-\",D77,1))-1))),\"\")),\"\")","v":1},{"$f":"IFERROR(IF(D77=\"\",\"0\",IFERROR(VALUE(TRIM(MID(D77,IFERROR(FIND(\"-\",D77,1),FIND(\"-\",D77,1))+1,500))),\"\")),\"\")","v":2},{"$f":"IFERROR(IF(OR(AK77=\"\",AL77=\"\"),\"\",IF(C77=$AJ$75,AK77,AL77)),\"\")","v":2},{"$f":"IFERROR(IF(OR(AK77=\"\",AL77=\"\"),\"\",IF(C77=$AJ$75,AL77,AK77)),\"\")","v":1},{"$f":"IFERROR(AM77+AN77,\"\")","v":3},{"$f":"IFERROR(IF(OR(AM77=\"\",AN77=\"\"),\"\",IF(AM77>AN77,3,IF(AM77<AN77,0,1))),\"\")","v":3},{"$f":"IFERROR(IF(AP77=\"\",\"\",IF(AP77=1,\"D\",IF(AP77=0,\"L\",IF(AP77=3,\"W\")))),\"\")","v":"W"},{"$f":"IFERROR(IF(AM77>AN77,18,IF(AM77=AN77,6,0)),\"\")","v":18},{"$f":"IF(AO77>=3,1,0)","v":1},{"$f":"IF((IF((IF(AM77>=1,1,0))>=1,1,0)+IF((IF(AN77>=1,1,0))>=1,1,0))>=2,1,0)","v":1},{"$f":"IF(AO77>=3,1,0)","v":1},{"$f":"((IF(AM77>=1,0,-0.75))+(IF(AN77>=1,0,-0.75))+IF(AO77<3,-0.75,0))","v":0},null,null,1,2,2,1,{"$f":"IFERROR(BA77+BB77,\"\")","v":3},{"$f":"IFERROR(IF(OR(BA77=\"\",BB77=\"\"),\"\",IF(BA77>BB77,3,IF(BA77<BB77,0,1))),\"\")","v":3},{"$f":"IFERROR(IF(BD77=\"\",\"\",IF(BD77=1,\"D\",IF(BD77=0,\"L\",IF(BD77=3,\"W\")))),\"\")","v":"W"},{"$f":"IFERROR(IF(BA77>BB77,18,IF(BA77=BB77,6,0)),\"\")","v":18},null,-8,"2.5 GOL ÜST"]
["D","2022-05-07","Cooks Hill United","0 - 1","Lambton Jaffas","0-1",null,null,null,null,null,null,null,null,null,null,null,null,null,null,null,null,null,null,null,null,null,null,null,null,null,null,null,null,null,null,0,1,1,0,1,3,"W",18,0,0,0,-1.5,null,null,0,1,1,0,1,3,"W",18,null,-7,"2.5 GOL ÜST"]
["D","2022-05-04","Lambton Jaffas","1 - 1","Newcastle Olympic","1-1",null,null,null,null,null,null,null,null,null,null,null,null,null,null,null,null,null,null,null,null,null,null,null,null,null,null,null,null,null,null,1,1,1,1,2,1,"D",6,0,1,0,-0.75,null,null,1,1,1,1,2,1,"D",6,null,-6,"2.5 GOL ÜST"]
["D","2022-04-15","Weston Bears","0 - 2","Lambton Jaffas","0-0",null,null,null,null,null,null,null,null,null,null,null,null,null,null,null,null,null,null,null,null,null,null,null,null,null,null,null,null,null,null,0,2,2,0,2,3,"W",18,0,0,0,-1.5,null,null,0,0,0,0,0,1,"D",6,null,-5,"2.5 GOL ÜST"]
["D","2022-03-27","Charlestown City B","3 - 1","Lambton Jaffas","1-0",null,null,null,null,null,null,null,null,null,null,null,null,null,null,null,null,null,null,null,null,null,null,null,null,null,null,null,null,null,null,3,1,1,3,4,0,"L",0,1,1,1,0,null,null,1,0,0,1,1,0,"L",0,null,-4,"MOST'A GÖRE RİSKLİ"]
["D","2022-03-20","Lambton Jaffas","2 - 1","Broadmeadow Magic","0-0",null,null,null,null,null,null,null,null,null,null,null,null,null,null,null,null,null,null,null,null,null,null,null,null,null,null,null,null,null,null,2,1,2,1,3,3,"W",18,1,1,1,0,null,null,0,0,0,0,0,1,"D",6,null,-3,"MOST'A GÖRE RİSKLİ"]
["D","2021-08-01","Lambton Jaffas","2 - 1","Broadmeadow Magic","1-0",null,null,null,null,null,null,null,null,null,null,null,null,null,null,null,null,null,null,null,null,null,null,null,null,null,null,null,null,null,null,2,1,2,1,3,3,"W",18,1,1,1,0,null,null,1,0,1,0,1,3,"W",18,null,-2,"MOST'A GÖRE RİSKLİ"]
["D","2021-07-17","Newcastle Olympic","1 - 2","Lambton Jaffas","1-2",null,null,null,null,null,null,null,null,null,null,null,null,null,null,null,null,null,null,null,null,null,null,null,null,null,null,null,null,null,null,1,2,2,1,3,3,"W",18,1,1,1,0,null,null,1,2,2,1,3,3,"W",18,null,-1,"MOST'A GÖRE RİSKLİ"]
["D","2021-07-10","Lambton Jaffas","5 - 1","Adamstown Rosebuds"," ",null,null,null,null,null,null,null,null,null,null,null,null,null,null,null,null,null,null,null,null,null,null,null,null,null,null,null,null,null,null,5,1,5,1,6,3,"W",18,1,1,1,0,null,null,"","","","","","","",6,null,0,"MOST'A GÖRE RİSKLİ"]
["D","2021-07-02","Lake Macquarie","2 - 3","Lambton Jaffas","1-2",null,null,null,null,null,null,null,null,null,null,null,null,null,null,null,null,null,null,null,null,null,null,null,null,null,null,null,null,null,null,2,3,3,2,5,3,"W",18,1,1,1,0,null,null,1,2,2,1,3,3,"W",18,null,1,"MOST'A GÖRE RİSKLİ"]
["D","2021-06-27","Valentine Phoenix","1 - 1","Lambton Jaffas","0-0",null,null,null,null,null,null,null,null,null,null,null,null,null,null,null,null,null,null,null,null,null,null,null,null,null,null,null,null,null,null,1,1,1,1,2,1,"D",6,0,1,0,-0.75,null,null,0,0,0,0,0,1,"D",6,null,2,"MOST'A GÖRE RİSKLİ"]
["D","2021-06-05","Lambton Jaffas","4 - 1","Weston Bears","2-1",null,null,null,null,null,null,null,null,null,null,null,null,null,null,null,null,null,null,null,null,null,null,null,null,null,null,null,null,null,null,4,1,4,1,5,3,"W",18,1,1,1,0,null,null,2,1,2,1,3,3,"W",18,null,3,"MOST'A GÖRE RİSKLİ"]
["D","2021-05-29","Lambton Jaffas","2 - 1","Maitland","1-1",null,null,null,null,null,null,null,null,null,null,null,null,null,null,null,null,null,null,null,null,null,null,null,null,null,null,null,null,null,null,2,1,2,1,3,3,"W",18,1,1,1,0,null,null,1,1,1,1,2,1,"D",6,null,4,"MOST'A GÖRE RİSKLİ"]
["D","2021-05-23","Charlestown City B","0 - 6","Lambton Jaffas","0-2",null,null,null,null,null,null,null,null,null,null,null,null,null,null,null,null,null,null,null,null,null,null,null,null,null,null,null,null,null,null,0,6,6,0,6,3,"W",18,1,0,1,-0.75,null,null,0,2,2,0,2,3,"W",18,null,5,"2.5 GOL ALT"]
[" ","G","B","M","AG","YG",null,null,null,null,null,null,null,null,null,null,null,null,null,null,null,null,null,null,null,null,null,null,null,null,null,null,null,null,null,null,null,null,null,null,null,null,null,null,null,null,null,null,null,null,null,null,null,null,null,null,null,null,null,6,"2.5 GOL ALT"]
["İlk Yarı",8,5,"1",15,"7",null,null,null,null,null,null,null,null,null,null,null,null,null,null,null,null,null,null,null,null,null,null,null,null,null,null,null,null,null,null,null,null,null,null,null,null,null,null,null,null,null,null,null,null,null,null,null,null,null,null,null,null,null,7,"2.5 GOL ALT"]
["Maç Sonu",11,3,"1",35,"15",null,null,null,null,null,null,null,null,null,null,null,null,null,null,null,null,null,null,null,null,null,null,null,null,null,null,null,null,null,{"$f":"IF(AJ113>13,\"MS1\",IF(AJ113>0,\"ÇŞ 1-X \",IF(AJ113<-17,\"MS2\",IF(AJ113<-1,\"ÇŞ X-2 \",\"MSX\"))))","v":"MS1"},null,null,{"$f":"SUM(AM76:AM92)","v":35},{"$f":"SUM(AN76:AN92)","v":15},null,null,null,{"$f":"SUM(AR76:AR92)","v":216},{"$f":"SUM(AS76:AS79)","v":1},{"$f":"SUM(AT76:AT79)","v":3},{"$f":"SUM(AU76:AU79)","v":1},{"$f":"SUM(AV76:AV79)","v":-3},null,{"$f":"IF(AX113>13,\"İY1\",IF(AX113>0,\"İY 1-X \",IF(AX113<-17,\"İY2\",IF(AX113<-1,\"İY X-2 \",\"İYX\"))))","v":"İY1"},null,null,{"$f":"SUM(BA76:BA92)","v":15},{"$f":"SUM(BB76:BB92)","v":7},null,null,null,{"$f":"SUM(BF76:BF92)","v":180},null,8,"2.5 GOL ALT"]
[null,null,null,null,null,null,null,null,null,null,null,null,null,null,null,null,null,null,null,null,null,null,null,null,null,null,null,null,null,null,null,null,null,null,null,null,null,null,null,null,null,null,null,null,null,null,null,null,null,null,null,null,null,null,null,null,null,null,null,9,"2.5 GOL ALT"]
[" ","Tarih","EvSahibi","MS","Deplasman","İY",null,null,null,null,null,null,null,null,null,null,null,null,null,null,null,null,null,null,null,null,null,null,null,null,null,null,null,null,null,{"$f":"A46","v":"Edgeworth Eagles"},"MS",null,null,null,null,null,null,null,"2.5 Ü","KG","2.5 A","KGY2.5A",null,{"$f":"AJ95","v":"Edgeworth Eagles"},"İY",null,null,null,null,null,null,null,null,10,"2.5 GOL ALT"]
["D","2022-06-08","Edgeworth Eagles","3 - 1","Cooks Hill United","3-0",null,null,null,null,null,null,null,null,null,null,null,null,null,null,null,null,null,null,null,null,null,null,null,null,null,null,null,null,null,null,{"$f":"IFERROR(IF(D96=\"\",\"0\",IFERROR(VALUE(TRIM(MID(D96,1,IFERROR(FIND(\"-\",D96,1),FIND(\"-\",D96,1))-1))),\"\")),\"\")","v":3},{"$f":"IFERROR(IF(D96=\"\",\"0\",IFERROR(VALUE(TRIM(MID(D96,IFERROR(FIND(\"-\",D96,1),FIND(\"-\",D96,1))+1,500))),\"\")),\"\")","v":1},{"$f":"IFERROR(IF(OR(AK96=\"\",AL96=\"\"),\"\",IF(C96=$AJ$95,AK96,AL96)),\"\")","v":3},{"$f":"IFERROR(IF(OR(AK96=\"\",AL96=\"\"),\"\",IF(C96=$AJ$95,AL96,AK96)),\"\")","v":1},{"$f":"IFERROR(AM96+AN96,\"\")","v":4},{"$f":"IFERROR(IF(OR(AM96=\"\",AN96=\"\"),\"\",IF(AM96>AN96,3,IF(AM96<AN96,0,1))),\"\")","v":3},{"$f":"IFERROR(IF(AP96=\"\",\"\",IF(AP96=1,\"D\",IF(AP96=0,\"L\",IF(AP96=3,\"W\")))),\"\")","v":"W"},{"$f":"IFERROR(IF(AM96>AN96,18,IF(AM96=AN96,6,0)),\"\")","v":18},{"$f":"IF(AO96>=3,1,0)","v":1},{"$f":"IF((IF((IF(AM96>=1,1,0))>=1,1,0)+IF((IF(AN96>=1,1,0))>=1,1,0))>=2,1,0)","v":1},{"$f":"IF(AO96>=3,1,0)","v":1},{"$f":"((IF(AM96>=1,0,-0.75))+(IF(AN96>=1,0,-0.75))+IF(AO96<3,-0.75,0))","v":0},null,null,{"$f":"IFERROR(IF(F96=\"\",\"0\",IFERROR(VALUE(TRIM(MID(F96,1,IFERROR(FIND(\"-\",F96,1),FIND(\"-\",F96,1))-1))),\"\")),\"\")","v":3},{"$f":"IFERROR(IF(F96=\"\",\"0\",IFERROR(VALUE(TRIM(MID(F96,IFERROR(FIND(\"-\",F96,1),FIND(\"-\",F96,1))+1,500))),\"\")),\"\")","v":0},{"$f":"IFERROR(IF(OR(AY96=\"\",AZ96=\"\"),\"\",IF(C96=$AJ$95,AY96,AZ96)),\"\")","v":3},{"$f":"IFERROR(IF(OR(AY96=\"\",AZ96=\"\"),\"\",IF(C96=$AJ$95,AZ96,AY96)),\"\")","v":0},{"$f":"IFERROR(BA96+BB96,\"\")","v":3},{"$f":"IFERROR(IF(OR(BA96=\"\",BB96=\"\"),\"\",IF(BA96>BB96,3,IF(BA96<BB96,0,1))),\"\")","v":3},{"$f":"IFERROR(IF(BD96=\"\",\"\",IF(BD96=1,\"D\",IF(BD96=0,\"L\",IF(BD96=3,\"W\")))),\"\")","v":"W"},{"$f":"IFERROR(IF(BA96>BB96,18,IF(BA96=BB96,6,0)),\"\")","v":18},null,11,"2.5 GOL ALT"]
["D","2022-06-05","Edgeworth Eagles","1 - 1","Adamstown Rosebuds","0-1",null,null,null,null,null,null,null,null,null,null,null,null,null,null,null,null,null,null,null,null,null,null,null,null,null,null,null,null,null,null,{"$f":"IFERROR(IF(D97=\"\",\"0\",IFERROR(VALUE(TRIM(MID(D97,1,IFERROR(FIND(\"-\",D97,1),FIND(\"-\",D97,1))-1))),\"\")),\"\")","v":1},{"$f":"IFERROR(IF(D97=\"\",\"0\",IFERROR(VALUE(TRIM(MID(D97,IFERROR(FIND(\"-\",D97,1),FIND(\"-\",D97,1))+1,500))),\"\")),\"\")","v":1},{"$f":"IFERROR(IF(OR(AK97=\"\",AL97=\"\"),\"\",IF(C97=$AJ$95,AK97,AL97)),\"\")","v":1},{"$f":"IFERROR(IF(OR(AK97=\"\",AL97=\"\"),\"\",IF(C97=$AJ$95,AL97,AK97)),\"\")","v":1},{"$f":"IFERROR(AM97+AN97,\"\")","v":2},{"$f":"IFERROR(IF(OR(AM97=\"\",AN97=\"\"),\"\",IF(AM97>AN97,3,IF(AM97<AN97,0,1))),\"\")","v":1},{"$f":"IFERROR(IF(AP97=\"\",\"\",IF(AP97=1,\"D\",IF(AP97=0,\"L\",IF(AP97=3,\"W\")))),\"\")","v":"D"},{"$f":"IFERROR(IF(AM97>AN97,18,IF(AM97=AN97,6,0)),\"\")","v":6},{"$f":"IF(AO97>=3,1,0)","v":0},{"$f":"IF((IF((IF(AM97>=1,1,0))>=1,1,0)+IF((IF(AN97>=1,1,0))>=1,1,0))>=2,1,0)","v":1},{"$f":"IF(AO97>=3,1,0)","v":0},{"$f":"((IF(AM97>=1,0,-0.75))+(IF(AN97>=1,0,-0.75))+IF(AO97<3,-0.75,0))","v":-0.75},null,null,0,1,0,1,{"$f":"IFERROR(BA97+BB97,\"\")","v":1},{"$f":"IFERROR(IF(OR(BA97=\"\",BB97=\"\"),\"\",IF(BA97>BB97,3,IF(BA97<BB97,0,1))),\"\")","v":0},{"$f":"IFERROR(IF(BD97=\"\",\"\",IF(BD97=1,\"D\",IF(BD97=0,\"L\",IF(BD97=3,\"W\")))),\"\")","v":"L"},{"$f":"IFERROR(IF(BA97>BB97,18,IF(BA97=BB97,6,0)),\"\")","v":0},null,12,"2.5 GOL ALT"]
["D","2022-05-29","Valentine Phoenix","1 - 0","Edgeworth Eagles","1-0",null,null,null,null,null,null,null,null,null,null,null,null,null,null,null,null,null,null,null,null,null,null,null,null,null,null,null,null,null,null,1,0,0,1,1,0,"L",0,0,0,0,-1.5,null,null,1,0,0,1,1,0,"L",0,null,13,"2.5 GOL ALT"]
["D","2022-05-08","Edgeworth Eagles","2 - 0","Newcastle Olympic","1-0",null,null,null,null,null,null,null,null,null,null,null,null,null,null,null,null,null,null,null,null,null,null,null,null,null,null,null,null,null,null,2,0,2,0,2,3,"W",18,0,0,0,-1.5,null,null,1,0,1,0,1,3,"W",18,null,14,"2.5 GOL ALT"]
["D","2022-05-01","Lake Macquarie","2 - 4","Edgeworth Eagles","0-3",null,null,null,null,null,null,null,null,null,null,null,null,null,null,null,null,null,null,null,null,null,null,null,null,null,null,null,null,null,null,2,4,4,2,6,3,"W",18,1,1,1,0,null,null,0,3,3,0,3,3,"W",18,null,15,"2.5 GOL ALT"]
["D","2022-04-10","Charlestown City B","6 - 2","Edgeworth Eagles","3-1",null,null,null,null,null,null,null,null,null,null,null,null,null,null,null,null,null,null,null,null,null,null,null,null,null,null,null,null,null,null,6,2,2,6,8,0,"L",0,1,1,1,0,null,null,3,1,1,3,4,0,"L",0]
["D","2022-04-02","Broadmeadow Magic","3 - 1","Edgeworth Eagles","1-0",null,null,null,null,null,null,null,null,null,null,null,null,null,null,null,null,null,null,null,null,null,null,null,null,null,null,null,null,null,null,3,1,1,3,4,0,"L",0,1,1,1,0,null,null,1,0,0,1,1,0,"L",0]
["D","2022-03-19","Edgeworth Eagles","0 - 2","Maitland","0-0",null,null,null,null,null,null,null,null,null,null,null,null,null,null,null,null,null,null,null,null,null,null,null,null,null,null,null,null,null,null,0,2,0,2,2,0,"L",0,0,0,0,-1.5,null,null,0,0,0,0,0,1,"D",6]
["D","2022-03-12","Adamstown Rosebuds","0 - 1","Edgeworth Eagles","0-0",null,null,null,null,null,null,null,null,null,null,null,null,null,null,null,null,null,null,null,null,null,null,null,null,null,null,null,null,null,null,0,1,1,0,1,3,"W",18,0,0,0,-1.5,null,null,0,0,0,0,0,1,"D",6]
["D","2021-08-01","Edgeworth Eagles","6 - 1","Valentine Phoenix","1-0",null,null,null,null,null,null,null,null,null,null,null,null,null,null,null,null,null,null,null,null,null,null,null,null,null,null,null,null,null,null,6,1,6,1,7,3,"W",18,1,1,1,0,null,null,1,0,1,0,1,3,"W",18]
["D","2021-07-04","Newcastle Olympic","1 - 2","Edgeworth Eagles","0-2",null,null,null,null,null,null,null,null,null,null,null,null,null,null,null,null,null,null,null,null,null,null,null,null,null,null,null,null,null,null,1,2,2,1,3,3,"W",18,1,1,1,0,null,null,0,2,2,0,2,3,"W",18]
["D","2021-06-05","Maitland","2 - 4","Edgeworth Eagles","2-1",null,null,null,null,null,null,null,null,null,null,null,null,null,null,null,null,null,null,null,null,null,null,null,null,null,null,null,null,null,null,2,4,4,2,6,3,"W",18,1,1,1,0,null,null,2,1,1,2,3,0,"L",0]
["D","2021-05-30","Broadmeadow Magic","2 - 1","Edgeworth Eagles","1-0",null,null,null,null,null,null,null,null,null,null,null,null,null,null,null,null,null,null,null,null,null,null,null,null,null,null,null,null,null,null,2,1,1,2,3,0,"L",0,1,1,1,0,null,null,1,0,0,1,1,0,"L",0]
["D","2021-05-23","Edgeworth Eagles","3 - 0","Adamstown Rosebuds","2-0",null,null,null,null,null,null,null,null,null,null,null,null,null,null,null,null,null,null,null,null,null,null,null,null,null,null,null,null,null,null,3,0,3,0,3,3,"W",18,1,0,1,-0.75,null,null,2,0,2,0,2,3,"W",18]
["D","2021-05-16","Valentine Phoenix","0 - 4","Edgeworth Eagles","0-2",null,null,null,null,null,null,null,null,null,null,null,null,null,null,null,null,null,null,null,null,null,null,null,null,null,null,null,null,null,null,0,4,4,0,4,3,"W",18,1,0,1,-0.75,null,null,0,2,2,0,2,3,"W",18]
[" ","G","B","M","AG","YG"]
["İlk Yarı",7,2,"6",16,"9"]
["Maç Sonu",9,1,"5",34,"22",null,null,null,null,null,null,null,null,null,null,null,null,null,null,null,null,null,null,null,null,null,null,null,null,null,null,null,null,null,{"$f":"AR93-AR113","v":48},null,null,{"$f":"SUM(AM96:AM112)","v":34},{"$f":"SUM(AN96:AN112)","v":22},null,null,null,{"$f":"SUM(AR96:AR112)","v":168},{"$f":"SUM(AS96:AS99)","v":1},{"$f":"SUM(AT96:AT99)","v":2},{"$f":"SUM(AU96:AU99)","v":1},{"$f":"SUM(AV96:AV99)","v":-3.75},null,{"$f":"BF93-BF113","v":42},null,null,{"$f":"SUM(BA96:BA112)","v":16},{"$f":"SUM(BB96:BB112)","v":9},null,null,null,{"$f":"SUM(BF96:BF112)","v":138}]
[null,null,null,null,null,null,null,null,null,null,null,null,null,null,null,null,null,null,null,null,null,null,null,null,null,null,null,null,null,null,null,null,null,null,null,null,null,null,null,null,null,null,null,null,{"$f":"ROUND(SUM(AS148+AT148+AU148+AV148-(AS182+AT182+AU182+AV182)),0)-1","v":-2},{"$f":"VLOOKUP(AS114,BH41:BI100,2,FALSE)","v":"MOST'A GÖRE RİSKLİ"}]
[" ","Tarih","EvSahibi","MS","Deplasman","İY",null,null,null,null,null,null,null,null,null,null,null,null,null,null,null,null,null,null,null,null,null,null,null,null,null,null,null,null,null,{"$f":"A21","v":"Lambton Jaffas"},"MS",null,null,null,null,null,null,null,"2.5 Ü","KG","2.5 A","KGY2.5A",null,{"$f":"AJ115","v":"Lambton Jaffas"},"İY"]
["D","2022-06-04","Lambton Jaffas","1 - 1","Weston Bears","1-0",null,null,null,null,null,null,null,null,null,null,null,null,null,null,null,null,null,null,null,null,null,null,null,null,null,null,null,null,null,null,{"$f":"IFERROR(IF(D116=\"\",\"0\",IFERROR(VALUE(TRIM(MID(D116,1,IFERROR(FIND(\"-\",D116,1),FIND(\"-\",D116,1))-1))),\"\")),\"\")","v":1},{"$f":"IFERROR(IF(D116=\"\",\"0\",IFERROR(VALUE(TRIM(MID(D116,IFERROR(FIND(\"-\",D116,1),FIND(\"-\",D116,1))+1,500))),\"\")),\"\")","v":1},{"$f":"IFERROR(IF(OR(AK116=\"\",AL116=\"\"),\"\",IF(C116=$AJ$115,AK116,AL116)),\"\")","v":1},{"$f":"IFERROR(IF(OR(AK116=\"\",AL116=\"\"),\"\",IF(C116=$AJ$115,AL116,AK116)),\"\")","v":1},{"$f":"IFERROR(AM116+AN116,\"\")","v":2},{"$f":"IFERROR(IF(OR(AM116=\"\",AN116=\"\"),\"\",IF(AM116>AN116,3,IF(AM116<AN116,0,1))),\"\")","v":1},{"$f":"IFERROR(IF(AP116=\"\",\"\",IF(AP116=1,\"D\",IF(AP116=0,\"L\",IF(AP116=3,\"W\")))),\"\")","v":"D"},{"$f":"IFERROR(IF(AM116>AN116,18,IF(AM116=AN116,6,0)),\"\")","v":6},{"$f":"IF(AO116>=3,1,0)","v":0},{"$f":"IF((IF((IF(AM116>=1,1,0))>=1,1,0)+IF((IF(AN116>=1,1,0))>=1,1,0))>=2,1,0)","v":1},{"$f":"IF(AO116>=3,1,0)","v":0},{"$f":"((IF(AM116>=1,0,-0.75))+(IF(AN116>=1,0,-0.75))+IF(AO116<3,-0.75,0))","v":-0.75},null,null,{"$f":"IFERROR(IF(F116=\"\",\"0\",IFERROR(VALUE(TRIM(MID(F116,1,IFERROR(FIND(\"-\",F116,1),FIND(\"-\",F116,1))-1))),\"\")),\"\")","v":1},{"$f":"IFERROR(IF(F116=\"\",\"0\",IFERROR(VALUE(TRIM(MID(F116,IFERROR(FIND(\"-\",F116,1),FIND(\"-\",F116,1))+1,500))),\"\")),\"\")","v":0},{"$f":"IFERROR(IF(OR(AY116=\"\",AZ116=\"\"),\"\",IF(C116=$AJ$115,AY116,AZ116)),\"\")","v":1},{"$f":"IFERROR(IF(OR(AY116=\"\",AZ116=\"\"),\"\",IF(C116=$AJ$115,AZ116,AY116)),\"\")","v":0},{"$f":"IFERROR(BA116+BB116,\"\")","v":1},{"$f":"IFERROR(IF(OR(BA116=\"\",BB116=\"\"),\"\",IF(BA116>BB116,3,IF(BA116<BB116,0,1))),\"\")","v":3},{"$f":"IFERROR(IF(BD116=\"\",\"\",IF(BD116=1,\"D\",IF(BD116=0,\"L\",IF(BD116=3,\"W\")))),\"\")","v":"W"},{"$f":"IFERROR(IF(BA116>BB116,18,IF(BA116=BB116,6,0)),\"\")","v":18}]
["D","2022-05-04","Lambton Jaffas","1 - 1","Newcastle Olympic","1-1",null,null,null,null,null,null,null,null,null,null,null,null,null,null,null,null,null,null,null,null,null,null,null,null,null,null,null,null,null,null,{"$f":"IFERROR(IF(D117=\"\",\"0\",IFERROR(VALUE(TRIM(MID(D117,1,IFERROR(FIND(\"-\",D117,1),FIND(\"-\",D117,1))-1))),\"\")),\"\")","v":1},{"$f":"IFERROR(IF(D117=\"\",\"0\",IFERROR(VALUE(TRIM(MID(D117,IFERROR(FIND(\"-\",D117,1),FIND(\"-\",D117,1))+1,500))),\"\")),\"\")","v":1},{"$f":"IFERROR(IF(OR(AK117=\"\",AL117=\"\"),\"\",IF(C117=$AJ$115,AK117,AL117)),\"\")","v":1},{"$f":"IFERROR(IF(OR(AK117=\"\",AL117=\"\"),\"\",IF(C117=$AJ$115,AL117,AK117)),\"\")","v":1},{"$f":"IFERROR(AM117+AN117,\"\")","v":2},{"$f":"IFERROR(IF(OR(AM117=\"\",AN117=\"\"),\"\",IF(AM117>AN117,3,IF(AM117<AN117,0,1))),\"\")","v":1},{"$f":"IFERROR(IF(AP117=\"\",\"\",IF(AP117=1,\"D\",IF(AP117=0,\"L\",IF(AP117=3,\"W\")))),\"\")","v":"D"},{"$f":"IFERROR(IF(AM117>AN117,18,IF(AM117=AN117,6,0)),\"\")","v":6},{"$f":"IF(AO117>=3,1,0)","v":0},{"$f":"IF((IF((IF(AM117>=1,1,0))>=1,1,0)+IF((IF(AN117>=1,1,0))>=1,1,0))>=2,1,0)","v":1},{"$f":"IF(AO117>=3,1,0)","v":0},{"$f":"((IF(AM117>=1,0,-0.75))+(IF(AN117>=1,0,-0.75))+IF(AO117<3,-0.75,0))","v":-0.75},null,null,1,1,1,1,{"$f":"IFERROR(BA117+BB117,\"\")","v":2},{"$f":"IFERROR(IF(OR(BA117=\"\",BB117=\"\"),\"\",IF(BA117>BB117,3,IF(BA117<BB117,0,1))),\"\")","v":1},{"$f":"IFERROR(IF(BD117=\"\",\"\",IF(BD117=1,\"D\",IF(BD117=0,\"L\",IF(BD117=3,\"W\")))),\"\")","v":"D"},{"$f":"IFERROR(IF(BA117>BB117,18,IF(BA117=BB117,6,0)),\"\")","v":6}]
["D","2022-03-20","Lambton Jaffas","2 - 1","Broadmeadow Magic","0-0",null,null,null,null,null,null,null,null,null,null,null,null,null,null,null,null,null,null,null,null,null,null,null,null,null,null,null,null,null,null,2,1,2,1,3,3,"W",18,1,1,1,0,null,null,0,0,0,0,0,1,"D",6]
["D","2021-08-01","Lambton Jaffas","2 - 1","Broadmeadow Magic","1-0",null,null,null,null,null,null,null,null,null,null,null,null,null,null,null,null,null,null,null,null,null,null,null,null,null,null,null,null,null,null,2,1,2,1,3,3,"W",18,1,1,1,0,null,null,1,0,1,0,1,3,"W",18]
["D","2021-07-10","Lambton Jaffas","5 - 1","Adamstown Rosebuds",null,null,null,null,null,null,null,null,null,null,null,null,null,null,null,null,null,null,null,null,null,null,null,null,null,null,null,null,null,null,null,5,1,5,1,6,3,"W",18,1,1,1,0,null,null,"0","0","0","0",0,1,"D",6]
["D","2021-06-05","Lambton Jaffas","4 - 1","Weston Bears","2-1",null,null,null,null,null,null,null,null,null,null,null,null,null,null,null,null,null,null,null,null,null,null,null,null,null,null,null,null,null,null,4,1,4,1,5,3,"W",18,1,1,1,0,null,null,2,1,2,1,3,3,"W",18]
["D","2021-05-29","Lambton Jaffas","2 - 1","Maitland","1-1",null,null,null,null,null,null,null,null,null,null,null,null,null,null,null,null,null,null,null,null,null,null,null,null,null,null,null,null,null,null,2,1,2,1,3,3,"W",18,1,1,1,0,null,null,1,1,1,1,2,1,"D",6]
["D","2021-05-08","Lambton Jaffas","1 - 2","Newcastle Olympic","1-0",null,null,null,null,null,null,null,null,null,null,null,null,null,null,null,null,null,null,null,null,null,null,null,null,null,null,null,null,null,null,1,2,1,2,3,0,"L",0,1,1,1,0,null,null,1,0,1,0,1,3,"W",18]
["D","2021-04-17","Lambton Jaffas","2 - 1","Lake Macquarie","1-1",null,null,null,null,null,null,null,null,null,null,null,null,null,null,null,null,null,null,null,null,null,null,null,null,null,null,null,null,null,null,2,1,2,1,3,3,"W",18,1,1,1,0,null,null,1,1,1,1,2,1,"D",6]
["D","2021-04-11","Lambton Jaffas","1 - 0","Valentine Phoenix",null,null,null,null,null,null,null,null,null,null,null,null,null,null,null,null,null,null,null,null,null,null,null,null,null,null,null,null,null,null,null,1,0,1,0,1,3,"W",18,0,0,0,-1.5,null,null,"0","0","0","0",0,1,"D",6]
["D","2021-04-02","Lambton Jaffas","0 - 2","Edgeworth Eagles","0-1",null,null,null,null,null,null,null,null,null,null,null,null,null,null,null,null,null,null,null,null,null,null,null,null,null,null,null,null,null,null,0,2,0,2,2,0,"L",0,0,0,0,-1.5,null,null,0,1,0,1,1,0,"L",0]
["D","2020-09-26","Lambton Jaffas","3 - 0","Lake Macquarie","1-0",null,null,null,null,null,null,null,null,null,null,null,null,null,null,null,null,null,null,null,null,null,null,null,null,null,null,null,null,null,null,3,0,3,0,3,3,"W",18,1,0,1,-0.75,null,null,1,0,1,0,1,3,"W",18]
["D","2020-09-12","Lambton Jaffas","0 - 0","Charlestown City B","0-0",null,null,null,null,null,null,null,null,null,null,null,null,null,null,null,null,null,null,null,null,null,null,null,null,null,null,null,null,null,null,0,0,0,0,0,1,"D",6,0,0,0,-2.25,null,null,0,0,0,0,0,1,"D",6]
["D","2020-09-06","Lambton Jaffas","3 - 1","Edgeworth Eagles","3-1",null,null,null,null,null,null,null,null,null,null,null,null,null,null,null,null,null,null,null,null,null,null,null,null,null,null,null,null,null,null,3,1,3,1,4,3,"W",18,1,1,1,0,null,null,3,1,3,1,4,3,"W",18]
["D","2020-08-22","Lambton Jaffas","6 - 3","Adamstown Rosebuds","3-1",null,null,null,null,null,null,null,null,null,null,null,null,null,null,null,null,null,null,null,null,null,null,null,null,null,null,null,null,null,null,6,3,6,3,9,3,"W",18,1,1,1,0,null,null,3,1,3,1,4,3,"W",18]
["D","2020-08-08","Lambton Jaffas","2 - 3","Broadmeadow Magic","0-0",null,null,null,null,null,null,null,null,null,null,null,null,null,null,null,null,null,null,null,null,null,null,null,null,null,null,null,null,null,null,2,3,2,3,5,0,"L",0,1,1,1,0,null,null,0,0,0,0,0,1,"D",6]
["D","2020-08-01","Lambton Jaffas","2 - 2","Hamilton Olympic","2-1",null,null,null,null,null,null,null,null,null,null,null,null,null,null,null,null,null,null,null,null,null,null,null,null,null,null,null,null,null,null,2,2,2,2,4,1,"D",6,1,1,1,0,null,null,2,1,2,1,3,3,"W",18]
["D","2020-07-18","Lambton Jaffas","2 - 3","Weston Bears","2-2",null,null,null,null,null,null,null,null,null,null,null,null,null,null,null,null,null,null,null,null,null,null,null,null,null,null,null,null,null,null,2,3,2,3,5,0,"L",0,1,1,1,0,null,null,2,2,2,2,4,1,"D",6]
["D","2019-08-25","Lambton Jaffas","3 - 0","Edgeworth Eagles","2-0",null,null,null,null,null,null,null,null,null,null,null,null,null,null,null,null,null,null,null,null,null,null,null,null,null,null,null,null,null,null,3,0,3,0,3,3,"W",18,1,0,1,-0.75,null,null,2,0,2,0,2,3,"W",18]
["D","2019-08-07","Lambton Jaffas","1 - 1","Maitland","1-1",null,null,null,null,null,null,null,null,null,null,null,null,null,null,null,null,null,null,null,null,null,null,null,null,null,null,null,null,null,null,1,1,1,1,2,1,"D",6,0,1,0,-0.75,null,null,1,1,1,1,2,1,"D",6]
["D","2019-08-03","Lambton Jaffas","2 - 0","Broadmeadow Magic","0-0",null,null,null,null,null,null,null,null,null,null,null,null,null,null,null,null,null,null,null,null,null,null,null,null,null,null,null,null,null,null,2,0,2,0,2,3,"W",18,0,0,0,-1.5,null,null,0,0,0,0,0,1,"D",6]
["D","2019-07-27","Lambton Jaffas","3 - 0","Newcastle Jets II","1-0",null,null,null,null,null,null,null,null,null,null,null,null,null,null,null,null,null,null,null,null,null,null,null,null,null,null,null,null,null,null,3,0,3,0,3,3,"W",18,1,0,1,-0.75,null,null,1,0,1,0,1,3,"W",18]
["D","2019-07-13","Lambton Jaffas","5 - 2","Valentine Phoenix","4-2",null,null,null,null,null,null,null,null,null,null,null,null,null,null,null,null,null,null,null,null,null,null,null,null,null,null,null,null,null,null,5,2,5,2,7,3,"W",18,1,1,1,0,null,null,4,2,4,2,6,3,"W",18]
["D","2019-06-15","Lambton Jaffas","2 - 0","Hamilton Olympic","2-0",null,null,null,null,null,null,null,null,null,null,null,null,null,null,null,null,null,null,null,null,null,null,null,null,null,null,null,null,null,null,2,0,2,0,2,3,"W",18,0,0,0,-1.5,null,null,2,0,2,0,2,3,"W",18]
["D","2019-05-18","Lambton Jaffas","2 - 2","Charlestown City B","0-0",null,null,null,null,null,null,null,null,null,null,null,null,null,null,null,null,null,null,null,null,null,null,null,null,null,null,null,null,null,null,2,2,2,2,4,1,"D",6,1,1,1,0,null,null,0,0,0,0,0,1,"D",6]
["D","2018-08-11","Lambton Jaffas","0 - 1","Maitland","0-1",null,null,null,null,null,null,null,null,null,null,null,null,null,null,null,null,null,null,null,null,null,null,null,null,null,null,null,null,null,null,0,1,0,1,1,0,"L",0,0,0,0,-1.5,null,null,0,1,0,1,1,0,"L",0]
["D","2018-07-24","Lambton Jaffas","3 - 0","Newcastle Jets U21","1-0",null,null,null,null,null,null,null,null,null,null,null,null,null,null,null,null,null,null,null,null,null,null,null,null,null,null,null,null,null,null,3,0,3,0,3,3,"W",18,1,0,1,-0.75,null,null,1,0,1,0,1,3,"W",18]
["D","2018-07-14","Lambton Jaffas","3 - 0","Valentine Phoenix","1-0",null,null,null,null,null,null,null,null,null,null,null,null,null,null,null,null,null,null,null,null,null,null,null,null,null,null,null,null,null,null,3,0,3,0,3,3,"W",18,1,0,1,-0.75,null,null,1,0,1,0,1,3,"W",18]
["D","2018-06-30","Lambton Jaffas","2 - 1","Charlestown City B","1-1",null,null,null,null,null,null,null,null,null,null,null,null,null,null,null,null,null,null,null,null,null,null,null,null,null,null,null,null,null,null,2,1,2,1,3,3,"W",18,1,1,1,0,null,null,1,1,1,1,2,1,"D",6]
["D","2018-06-16","Lambton Jaffas","1 - 1","Broadmeadow Magic","0-1",null,null,null,null,null,null,null,null,null,null,null,null,null,null,null,null,null,null,null,null,null,null,null,null,null,null,null,null,null,null,1,1,1,1,2,1,"D",6,0,1,0,-0.75,null,null,0,1,0,1,1,0,"L",0]
[" ","G","B","M","AG","YG"]
["İlk Yarı",14,11,"3",32,"16"]
["Maç Sonu",18,7,"5",66,"32",null,null,null,null,null,null,null,null,null,null,null,null,null,null,null,null,null,null,null,null,null,null,null,null,null,null,null,null,null,{"$f":"IF(AJ182>13,\"MS1\",IF(AJ182>0,\"ÇŞ 1-X \",IF(AJ182<-17,\"MS2\",IF(AJ168<-1,\"ÇŞ X-2 \",\"MSX\"))))","v":"MS1"},null,null,{"$f":"SUM(AM116:AM147)","v":66},{"$f":"SUM(AN116:AN147)","v":32},null,null,null,{"$f":"SUM(AR116:AR147)","v":366},{"$f":"SUM(AS116:AS119)","v":2},{"$f":"SUM(AT116:AT119)","v":4},{"$f":"SUM(AU116:AU119)","v":2},{"$f":"SUM(AV116:AV119)","v":-1.5},null,{"$f":"IF(AX182>13,\"İY1\",IF(AX182>0,\"İY 1-X \",IF(AX182<-17,\"İY2\",IF(AX168<-1,\"İY X-2 \",\"İYX\"))))","v":"İY1"},null,null,{"$f":"SUM(BA116:BA147)","v":32},{"$f":"SUM(BB116:BB147)","v":16},null,null,null,{"$f":"SUM(BF116:BF147)","v":330}]
[" ","Tarih","EvSahibi","MS","Deplasman","İY",null,null,null,null,null,null,null,null,null,null,null,null,null,null,null,null,null,null,null,null,null,null,null,null,null,null,null,null,null,{"$f":"A46","v":"Edgeworth Eagles"},"MS",null,null,null,null,null,null,null,"2.5 Ü","KG","2.5 A","KGY2.5A",null,{"$f":"AJ149","v":"Edgeworth Eagles"},"İY"]
["D","2022-05-29","Valentine Phoenix","1 - 0","Edgeworth Eagles","1-0",null,null,null,null,null,null,null,null,null,null,null,null,null,null,null,null,null,null,null,null,null,null,null,null,null,null,null,null,null,null,{"$f":"IFERROR(IF(D150=\"\",\"0\",IFERROR(VALUE(TRIM(MID(D150,1,IFERROR(FIND(\"-\",D150,1),FIND(\"-\",D150,1))-1))),\"\")),\"\")","v":1},{"$f":"IFERROR(IF(D150=\"\",\"0\",IFERROR(VALUE(TRIM(MID(D150,IFERROR(FIND(\"-\",D150,1),FIND(\"-\",D150,1))+1,500))),\"\")),\"\")","v":0},{"$f":"IFERROR(IF(OR(AK150=\"\",AL150=\"\"),\"\",IF(C150=$AJ$149,AK150,AL150)),\"\")","v":0},{"$f":"IFERROR(IF(OR(AK150=\"\",AL150=\"\"),\"\",IF(C150=$AJ$149,AL150,AK150)),\"\")","v":1},{"$f":"IFERROR(AM150+AN150,\"\")","v":1},{"$f":"IFERROR(IF(OR(AM150=\"\",AN150=\"\"),\"\",IF(AM150>AN150,3,IF(AM150<AN150,0,1))),\"\")","v":0},{"$f":"IFERROR(IF(AP150=\"\",\"\",IF(AP150=1,\"D\",IF(AP150=0,\"L\",IF(AP150=3,\"W\")))),\"\")","v":"L"},{"$f":"IFERROR(IF(AM150>AN150,18,IF(AM150=AN150,6,0)),\"\")","v":0},{"$f":"IF(AO150>=3,1,0)","v":0},{"$f":"IF((IF((IF(AM150>=1,1,0))>=1,1,0)+IF((IF(AN150>=1,1,0))>=1,1,0))>=2,1,0)","v":0},{"$f":"IF(AO150>=3,1,0)","v":0},{"$f":"((IF(AM150>=1,0,-0.75))+(IF(AN150>=1,0,-0.75))+IF(AO150<3,-0.75,0))","v":-1.5},null,null,{"$f":"IFERROR(IF(F150=\"\",\"0\",IFERROR(VALUE(TRIM(MID(F150,1,IFERROR(FIND(\"-\",F150,1),FIND(\"-\",F150,1))-1))),\"\")),\"\")","v":1},{"$f":"IFERROR(IF(F150=\"\",\"0\",IFERROR(VALUE(TRIM(MID(F150,IFERROR(FIND(\"-\",F150,1),FIND(\"-\",F150,1))+1,500))),\"\")),\"\")","v":0},{"$f":"IFERROR(IF(OR(AY150=\"\",AZ150=\"\"),\"\",IF(C150=$AJ$149,AY150,AZ150)),\"\")","v":0},{"$f":"IFERROR(IF(OR(AY150=\"\",AZ150=\"\"),\"\",IF(C150=$AJ$149,AZ150,AY150)),\"\")","v":1},{"$f":"IFERROR(BA150+BB150,\"\")","v":1},{"$f":"IFERROR(IF(OR(BA150=\"\",BB150=\"\"),\"\",IF(BA150>BB150,3,IF(BA150<BB150,0,1))),\"\")","v":0},{"$f":"IFERROR(IF(BD150=\"\",\"\",IF(BD150=1,\"D\",IF(BD150=0,\"L\",IF(BD150=3,\"W\")))),\"\")","v":"L"},{"$f":"IFERROR(IF(BA150>BB150,18,IF(BA150=BB150,6,0)),\"\")","v":0}]
["D","2022-05-01","Lake Macquarie","2 - 4","Edgeworth Eagles","0-3",null,null,null,null,null,null,null,null,null,null,null,null,null,null,null,null,null,null,null,null,null,null,null,null,null,null,null,null,null,null,{"$f":"IFERROR(IF(D151=\"\",\"0\",IFERROR(VALUE(TRIM(MID(D151,1,IFERROR(FIND(\"-\",D151,1),FIND(\"-\",D151,1))-1))),\"\")),\"\")","v":2},{"$f":"IFERROR(IF(D151=\"\",\"0\",IFERROR(VALUE(TRIM(MID(D151,IFERROR(FIND(\"-\",D151,1),FIND(\"-\",D151,1))+1,500))),\"\")),\"\")","v":4},{"$f":"IFERROR(IF(OR(AK151=\"\",AL151=\"\"),\"\",IF(C151=$AJ$149,AK151,AL151)),\"\")","v":4},{"$f":"IFERROR(IF(OR(AK151=\"\",AL151=\"\"),\"\",IF(C151=$AJ$149,AL151,AK151)),\"\")","v":2},{"$f":"IFERROR(AM151+AN151,\"\")","v":6},{"$f":"IFERROR(IF(OR(AM151=\"\",AN151=\"\"),\"\",IF(AM151>AN151,3,IF(AM151<AN151,0,1))),\"\")","v":3},{"$f":"IFERROR(IF(AP151=\"\",\"\",IF(AP151=1,\"D\",IF(AP151=0,\"L\",IF(AP151=3,\"W\")))),\"\")","v":"W"},{"$f":"IFERROR(IF(AM151>AN151,18,IF(AM151=AN151,6,0)),\"\")","v":18},{"$f":"IF(AO151>=3,1,0)","v":1},{"$f":"IF((IF((IF(AM151>=1,1,0))>=1,1,0)+IF((IF(AN151>=1,1,0))>=1,1,0))>=2,1,0)","v":1},{"$f":"IF(AO151>=3,1,0)","v":1},{"$f":"((IF(AM151>=1,0,-0.75))+(IF(AN151>=1,0,-0.75))+IF(AO151<3,-0.75,0))","v":0},null,null,0,3,3,0,{"$f":"IFERROR(BA151+BB151,\"\")","v":3},{"$f":"IFERROR(IF(OR(BA151=\"\",BB151=\"\"),\"\",IF(BA151>BB151,3,IF(BA151<BB151,0,1))),\"\")","v":3},{"$f":"IFERROR(IF(BD151=\"\",\"\",IF(BD151=1,\"D\",IF(BD151=0,\"L\",IF(BD151=3,\"W\")))),\"\")","v":"W"},{"$f":"IFERROR(IF(BA151>BB151,18,IF(BA151=BB151,6,0)),\"\")","v":18}]
["D","2022-04-10","Charlestown City B","6 - 2","Edgeworth Eagles","3-1",null,null,null,null,null,null,null,null,null,null,null,null,null,null,null,null,null,null,null,null,null,null,null,null,null,null,null,null,null,null,6,2,2,6,8,0,"L",0,1,1,1,0,null,null,3,1,1,3,4,0,"L",0]
["D","2022-04-02","Broadmeadow Magic","3 - 1","Edgeworth Eagles","1-0",null,null,null,null,null,null,null,null,null,null,null,null,null,null,null,null,null,null,null,null,null,null,null,null,null,null,null,null,null,null,3,1,1,3,4,0,"L",0,1,1,1,0,null,null,1,0,0,1,1,0,"L",0]
["D","2022-03-12","Adamstown Rosebuds","0 - 1","Edgeworth Eagles","0-0",null,null,null,null,null,null,null,null,null,null,null,null,null,null,null,null,null,null,null,null,null,null,null,null,null,null,null,null,null,null,0,1,1,0,1,3,"W",18,0,0,0,-1.5,null,null,0,0,0,0,0,1,"D",6]
["D","2021-07-04","Newcastle Olympic","1 - 2","Edgeworth Eagles","0-2",null,null,null,null,null,null,null,null,null,null,null,null,null,null,null,null,null,null,null,null,null,null,null,null,null,null,null,null,null,null,1,2,2,1,3,3,"W",18,1,1,1,0,null,null,0,2,2,0,2,3,"W",18]
["D","2021-06-05","Maitland","2 - 4","Edgeworth Eagles","2-1",null,null,null,null,null,null,null,null,null,null,null,null,null,null,null,null,null,null,null,null,null,null,null,null,null,null,null,null,null,null,2,4,4,2,6,3,"W",18,1,1,1,0,null,null,2,1,1,2,3,0,"L",0]
["D","2021-05-30","Broadmeadow Magic","2 - 1","Edgeworth Eagles","1-0",null,null,null,null,null,null,null,null,null,null,null,null,null,null,null,null,null,null,null,null,null,null,null,null,null,null,null,null,null,null,2,1,1,2,3,0,"L",0,1,1,1,0,null,null,1,0,0,1,1,0,"L",0]
["D","2021-05-16","Valentine Phoenix","0 - 4","Edgeworth Eagles","0-2",null,null,null,null,null,null,null,null,null,null,null,null,null,null,null,null,null,null,null,null,null,null,null,null,null,null,null,null,null,null,0,4,4,0,4,3,"W",18,1,0,1,-0.75,null,null,0,2,2,0,2,3,"W",18]
["D","2021-04-24","Charlestown City B","0 - 2","Edgeworth Eagles","0-0",null,null,null,null,null,null,null,null,null,null,null,null,null,null,null,null,null,null,null,null,null,null,null,null,null,null,null,null,null,null,0,2,2,0,2,3,"W",18,0,0,0,-1.5,null,null,0,0,0,0,0,1,"D",6]
["D","2021-04-11","Lake Macquarie","3 - 2","Edgeworth Eagles","1-2",null,null,null,null,null,null,null,null,null,null,null,null,null,null,null,null,null,null,null,null,null,null,null,null,null,null,null,null,null,null,3,2,2,3,5,0,"L",0,1,1,1,0,null,null,1,2,2,1,3,3,"W",18]
["D","2021-04-02","Lambton Jaffas","0 - 2","Edgeworth Eagles","0-1",null,null,null,null,null,null,null,null,null,null,null,null,null,null,null,null,null,null,null,null,null,null,null,null,null,null,null,null,null,null,0,2,2,0,2,3,"W",18,0,0,0,-1.5,null,null,0,1,1,0,1,3,"W",18]
["D","2020-09-26","Maitland","2 - 1","Edgeworth Eagles","0-1",null,null,null,null,null,null,null,null,null,null,null,null,null,null,null,null,null,null,null,null,null,null,null,null,null,null,null,null,null,null,2,1,1,2,3,0,"L",0,1,1,1,0,null,null,0,1,1,0,1,3,"W",18]
["D","2020-09-20","Hamilton Olympic","1 - 3","Edgeworth Eagles","0-1",null,null,null,null,null,null,null,null,null,null,null,null,null,null,null,null,null,null,null,null,null,null,null,null,null,null,null,null,null,null,1,3,3,1,4,3,"W",18,1,1,1,0,null,null,0,1,1,0,1,3,"W",18]
["D","2020-09-06","Lambton Jaffas","3 - 1","Edgeworth Eagles","3-1",null,null,null,null,null,null,null,null,null,null,null,null,null,null,null,null,null,null,null,null,null,null,null,null,null,null,null,null,null,null,3,1,1,3,4,0,"L",0,1,1,1,0,null,null,3,1,1,3,4,0,"L",0]
["D","2020-08-23","Valentine Phoenix","0 - 2","Edgeworth Eagles","0-0",null,null,null,null,null,null,null,null,null,null,null,null,null,null,null,null,null,null,null,null,null,null,null,null,null,null,null,null,null,null,0,2,2,0,2,3,"W",18,0,0,0,-1.5,null,null,0,0,0,0,0,1,"D",6]
["D","2020-08-09","Lake Macquarie","0 - 3","Edgeworth Eagles","0-3",null,null,null,null,null,null,null,null,null,null,null,null,null,null,null,null,null,null,null,null,null,null,null,null,null,null,null,null,null,null,0,3,3,0,3,3,"W",18,1,0,1,-0.75,null,null,0,3,3,0,3,3,"W",18]
["D","2020-08-02","Broadmeadow Magic","0 - 1","Edgeworth Eagles","0-0",null,null,null,null,null,null,null,null,null,null,null,null,null,null,null,null,null,null,null,null,null,null,null,null,null,null,null,null,null,null,0,1,1,0,1,3,"W",18,0,0,0,-1.5,null,null,0,0,0,0,0,1,"D",6]
["D","2020-07-19","Adamstown Rosebuds","1 - 3","Edgeworth Eagles","0-2",null,null,null,null,null,null,null,null,null,null,null,null,null,null,null,null,null,null,null,null,null,null,null,null,null,null,null,null,null,null,1,3,3,1,4,3,"W",18,1,1,1,0,null,null,0,2,2,0,2,3,"W",18]
["D","2019-08-25","Lambton Jaffas","3 - 0","Edgeworth Eagles","2-0",null,null,null,null,null,null,null,null,null,null,null,null,null,null,null,null,null,null,null,null,null,null,null,null,null,null,null,null,null,null,3,0,0,3,3,0,"L",0,1,0,1,-0.75,null,null,2,0,0,2,2,0,"L",0]
["D","2019-08-04","Valentine Phoenix","3 - 1","Edgeworth Eagles","1-0",null,null,null,null,null,null,null,null,null,null,null,null,null,null,null,null,null,null,null,null,null,null,null,null,null,null,null,null,null,null,3,1,1,3,4,0,"L",0,1,1,1,0,null,null,1,0,0,1,1,0,"L",0]
["D","2019-07-24","Darwin Olympic","0 - 3","Edgeworth Eagles","0-2",null,null,null,null,null,null,null,null,null,null,null,null,null,null,null,null,null,null,null,null,null,null,null,null,null,null,null,null,null,null,0,3,3,0,3,3,"W",18,1,0,1,-0.75,null,null,0,2,2,0,2,3,"W",18]
["D","2019-07-13","Adamstown Rosebuds","0 - 1","Edgeworth Eagles","0-1",null,null,null,null,null,null,null,null,null,null,null,null,null,null,null,null,null,null,null,null,null,null,null,null,null,null,null,null,null,null,0,1,1,0,1,3,"W",18,0,0,0,-1.5,null,null,0,1,1,0,1,3,"W",18]
["D","2019-07-06","Hamilton Olympic","1 - 4","Edgeworth Eagles","1-0",null,null,null,null,null,null,null,null,null,null,null,null,null,null,null,null,null,null,null,null,null,null,null,null,null,null,null,null,null,null,1,4,4,1,5,3,"W",18,1,1,1,0,null,null,1,0,0,1,1,0,"L",0]
["D","2019-06-23","Newcastle Jets II","1 - 2","Edgeworth Eagles","1-1",null,null,null,null,null,null,null,null,null,null,null,null,null,null,null,null,null,null,null,null,null,null,null,null,null,null,null,null,null,null,1,2,2,1,3,3,"W",18,1,1,1,0,null,null,1,1,1,1,2,1,"D",6]
["D","2019-06-16","Charlestown City B","1 - 0","Edgeworth Eagles","0-0",null,null,null,null,null,null,null,null,null,null,null,null,null,null,null,null,null,null,null,null,null,null,null,null,null,null,null,null,null,null,1,0,0,1,1,0,"L",0,0,0,0,-1.5,null,null,0,0,0,0,0,1,"D",6]
["D","2019-05-19","Weston Bears","2 - 1","Edgeworth Eagles","0-0",null,null,null,null,null,null,null,null,null,null,null,null,null,null,null,null,null,null,null,null,null,null,null,null,null,null,null,null,null,null,2,1,1,2,3,0,"L",0,1,1,1,0,null,null,0,0,0,0,0,1,"D",6]
["D","2018-08-19","Valentine Phoenix","0 - 1","Edgeworth Eagles","0-0",null,null,null,null,null,null,null,null,null,null,null,null,null,null,null,null,null,null,null,null,null,null,null,null,null,null,null,null,null,null,0,1,1,0,1,3,"W",18,0,0,0,-1.5,null,null,0,0,0,0,0,1,"D",6]
["D","2018-08-05","Adamstown Rosebuds","0 - 1","Edgeworth Eagles","0-0",null,null,null,null,null,null,null,null,null,null,null,null,null,null,null,null,null,null,null,null,null,null,null,null,null,null,null,null,null,null,0,1,1,0,1,3,"W",18,0,0,0,-1.5,null,null,0,0,0,0,0,1,"D",6]
["D","2018-07-22","Charlestown City B","0 - 2","Edgeworth Eagles","0-1",null,null,null,null,null,null,null,null,null,null,null,null,null,null,null,null,null,null,null,null,null,null,null,null,null,null,null,null,null,null,0,2,2,0,2,3,"W",18,0,0,0,-1.5,null,null,0,1,1,0,1,3,"W",18]
[" ","G","B","M","AG","YG"]
["İlk Yarı",12,9,"9",25,"17"]
["Maç Sonu",19,0,"11",55,"38",null,null,null,null,null,null,null,null,null,null,null,null,null,null,null,null,null,null,null,null,null,null,null,null,null,null,null,null,null,{"$f":"AR148-AR182","v":24},null,null,{"$f":"SUM(AM150:AM181)","v":55},{"$f":"SUM(AN150:AN181)","v":38},null,null,null,{"$f":"SUM(AR150:AR181)","v":342},{"$f":"SUM(AS150:AS153)","v":3},{"$f":"SUM(AT150:AT153)","v":3},{"$f":"SUM(AU150:AU153)","v":3},{"$f":"SUM(AV150:AV153)","v":-1.5},null,{"$f":"BF148-BF182","v":60},null,null,{"$f":"SUM(BA150:BA181)","v":25},{"$f":"SUM(BB150:BB181)","v":17},null,null,null,{"$f":"SUM(BF150:BF181)","v":270}]
["Rekabet Analizi"]
[" ","Tarih","EvSahibi","MS","Deplasman","İY","Lig"]
["Detay","2021-04-02","Lambton Jaffas","0 - 2","Edgeworth Eagles","0-1","Avustralya-Ulusal Premier Lig Kuzey YGG"]
["Detay","2020-09-06","Lambton Jaffas","3 - 1","Edgeworth Eagles","3-1","Avustralya-Ulusal Premier Lig Kuzey YGG"]
["Detay","2019-08-25","Lambton Jaffas","3 - 0","Edgeworth Eagles","2-0","Avustralya-Ulusal Premier Lig Kuzey YGG"]
["Detay","2018-03-17","Lambton Jaffas","4 - 3","Edgeworth Eagles","2-1","Avustralya - Ulusal Premier Lig Kuzey YGG"]
["Detay","2017-06-10","Lambton Jaffas","0 - 5","Edgeworth Eagles"," ","Avustralya - FFA Kupasi 6.Tur"]
["Detay","2017-03-29","Lambton Jaffas","2 - 1","Edgeworth Eagles","0-0","Avustralya - Ulusal Premier Lig Kuzey YGG"]
["Detay","2016-04-09","Lambton Jaffas","1 - 2","Edgeworth Eagles","0-0","Avustralya - Ulusal Premier Lig Kuzey YGG"]
["Detay","2015-07-25","Lambton Jaffas","1 - 2","Edgeworth Eagles"," ","Avustralya - Ulusal Premier Lig Kuzey YGG"]
["Detay","2014-05-10","Lambton Jaffas","0 - 0","Edgeworth Eagles","0-0","Avustralya - Ulusal Premier Lig Kuzey YGG"]
["Detay","2013-07-20","Lambton Jaffas","4 - 3","Edgeworth Eagles","2-2","Avustralya - Ulusal Premier Lig Kuzey YGG"]
["Bahis oynayan tüm bireyler, bulunduğu ülkenin kural ve yasalarından sorumludur"]
[]
[]
["Detay","2013-08-25","Cooma Tigers","2 - 7","Canberra FC","1-4","Avustralya - Ulusal Premier Lig Baskent Bölgesi"]
["Detay","2012-08-19","Cooma Tigers","0 - 0","Canberra FC"," ","Avustralya - Ulusal Premier Lig Baskent Bölgesi"]
["Detay","2012-05-13","Cooma Tigers","1 - 1","Canberra FC"," ","Avustralya - Ulusal Premier Lig Baskent Bölgesi"]
["Detay","2011-07-31","Cooma Tigers","3 - 3","Canberra FC"," ","Avustralya - Ulusal Premier Lig Baskent Bölgesi"]
["Detay","2010-05-08","Cooma Tigers","1 - 1","Canberra FC"," ","Avustralya - Ulusal Premier Lig Baskent Bölgesi"]
["Bahis oynayan tüm bireyler, bulunduğu ülkenin kural ve yasalarından sorumludur"]
[]
["Detay","2010-09-26","Bolivar","1 - 0","Blooming","0-0","Bolivya - LFPB Clausura"]
["Detay","2009-10-22","Bolivar","1 - 1","Blooming","1-1","Bolivya - LFPB Clausura Play Off"]
["Detay","2009-09-17","Bolivar","4 - 1","Blooming","2-1","Bolivya - LFPB Clausura"]
["Detay","2009-04-19","Bolivar","0 - 0","Blooming","0-0","Bolivya - LFPB Apertura"]
["Detay","2008-05-01","Bolivar","0 - 0","Blooming"," ","Bolivya - LFPB Apertura"]
["Detay","2007-05-17","Bolivar","3 - 2","Blooming","3-0","Bolivya - LFPB Apertura"]
["Detay","2006-11-27","Bolivar","2 - 2","Blooming"," ","Bolivya - LFPB Hexagonal Final"]
["Detay","2006-04-23","Bolivar","2 - 1","Blooming"," ","Bolivya - LFPB Clausura"]
["Detay","2005-11-23","Bolivar","4 - 2","Blooming"," ","Bolivya - LFPB Hexagonal Final"]
["Detay","2005-04-07","Bolivar","5 - 0","Blooming","0-0","Bolivya - LFPB Torneo Adecuacion"]
["Detay","2004-11-10","Bolivar","6 - 2","Blooming","0-0","Bolivya - LFPB Clausura 2.Tur"]
["Detay","2004-05-19","Bolivar","4 - 0","Blooming","0-0","Bolivya - LFPB Apertura"]
["Bahis oynayan tüm bireyler, bulunduğu ülkenin kural ve yasalarından sorumludur"]

{"sheet":"Veri3","index":3,"n_rows":26,"n_cols":37,"rows_kept":26,"cut":false,"hidden":false,"merged":[[10,48,13,56],[13,12,13,26],[14,12,14,26],[15,48,17,56],[20,12,20,26],[7,12,7,26],[2,32,2,34],[1,35,2,36],[1,28,3,28],[1,12,1,26],[1,29,1,31],[1,32,1,34],[2,29,2,31]]}
[]
[null,"Standings",null,null,null,null,null,null,null,null,null,null,"İLK YARI SONUCU",null,null,null,null,null,null,null,null,null,null,null,null,null,null,null,"ANALİZ SONUÇLARI",{"$f":"$B$3","v":"[4]   Lambton Jarvis"},null,null,{"$f":"$B$14","v":"[5]   Edgeworth Eagles FC"},null,null,"BTT/KG VE HT/FT-İY/MS"]
[null,"[4]   Lambton Jarvis",null,null,null,null,null,null,null,null,null,null,"EV SAHİBİ","O","G","B","M","A","Y","G","B","M","A","Y","AV","TOPL. PU","ORT. PU",null,null,"HT/İY",null,null,"FT/MS"]
[null,"FT","Matches","Win","Draw","Loss","Scored","Conceded","Pts","Rank","Rate",null,"GENEL",{"$f":"C10","v":7},3,3,1,5,3,{"$f":"IF(N4=0,0,O4/N4)","v":0.42857142857142855},{"$f":"IF(N4=0,0,P4/N4)","v":0.42857142857142855},{"$f":"IF(N4=0,0,Q4/N4)","v":0.14285714285714285},{"$f":"IF(N4=0,0,R4/N4)","v":0.7142857142857143},{"$f":"IF(N4=0,0,S4/N4)","v":0.42857142857142855},{"$f":"R4-S4","v":2},{"$f":"(O4*3)+(P4*1)+(Q4*0)","v":12},{"$f":"Z4/N4","v":1.7142857142857142},null,null,"1-X-2","SKOR","ALT-ÜST","1-X-2","SKOR","ALT-ÜST","BTT/KG VAR","SONUÇ"]
[null,"Total",7,4,2,1,10,7,14,4,"57.1%",null,"İÇERDE",3,1,2,0,2,1,{"$f":"IF(N5=0,0,O5/N5)","v":0.33333333333333331},{"$f":"IF(N5=0,0,P5/N5)","v":0.66666666666666663},{"$f":"IF(N5=0,0,Q5/N5)","v":0},{"$f":"IF(N5=0,0,R5/N5)","v":0.66666666666666663},{"$f":"IF(N5=0,0,S5/N5)","v":0.33333333333333331},{"$f":"R5-S5","v":1},{"$f":"(O5*3)+(P5*1)+(Q5*0)","v":5},{"$f":"Z5/N5","v":1.6666666666666667},null,"GENEL ANALİZ",{"$f":"LEFT(NW!$K$10,1)","v":"X"},{"$f":"NW!H10","v":"1 - 1"},{"$f":"NW!H19","v":"1.5 GOL ÜST"},{"$f":"RIGHT(NW!$K$10,1)","v":"1"},{"$f":"NW!P10","v":"2 - 1"},{"$f":"NW!M19","v":"2.5 GOL ÜST"},{"$f":"NW!K8","v":"VAR"},{"$f":"NW!K10","v":"X / 1"}]
[null,"Home",3,1,2,0,4,3,5,7,"33.3%",null,"DIŞARDA",4,2,1,1,3,2,{"$f":"IF(N6=0,0,O6/N6)","v":0.5},{"$f":"IF(N6=0,0,P6/N6)","v":0.25},{"$f":"IF(N6=0,0,Q6/N6)","v":0.25},{"$f":"IF(N6=0,0,R6/N6)","v":0.75},{"$f":"IF(N6=0,0,S6/N6)","v":0.5},{"$f":"R6-S6","v":1},{"$f":"(O6*3)+(P6*1)+(Q6*0)","v":7},{"$f":"Z6/N6","v":1.75},null,"İÇ-DIŞ ANALİZ",{"$f":"LEFT(NW!$AJ$10,1)","v":"1"},{"$f":"NW!AG10","v":"1 - 0"},{"$f":"NW!AG19","v":"1.5 GOL ÜST"},{"$f":"RIGHT(NW!$AJ$10,1)","v":"1"},{"$f":"NW!AO10","v":"2 - 1"},{"$f":"NW!AL19","v":"2.5 GOL ÜST"},{"$f":"NW!AJ8","v":"VAR"},{"$f":"NW!AJ10","v":"1 / 1"}]
[null,"Away",4,3,0,1,6,4,9,3,"75.0%",null,"SON 6 MAÇ",6,3,2,1,5,3,{"$f":"IF(N7=0,0,O7/N7)","v":0.5},{"$f":"IF(N7=0,0,P7/N7)","v":0.33333333333333331},{"$f":"IF(N7=0,0,Q7/N7)","v":0.16666666666666666},{"$f":"IF(N7=0,0,R7/N7)","v":0.83333333333333337},{"$f":"IF(N7=0,0,S7/N7)","v":0.5},{"$f":"R7-S7","v":2},{"$f":"(O7*3)+(P7*1)+(Q7*0)","v":11},{"$f":"Z7/N7","v":1.8333333333333333},null,"SON 6 ANALİZİ",{"$f":"LEFT(NW!$BG$10,1)","v":"X"},{"$f":"NW!BD10","v":"1 - 1"},{"$f":"NW!BD19","v":"1.5 GOL ÜST"},{"$f":"RIGHT(NW!$BG$10,1)","v":"1"},{"$f":"NW!BL10","v":"2 - 1"},{"$f":"NW!BI19","v":"2.5 GOL ÜST"},{"$f":"NW!BG8","v":"VAR"},{"$f":"NW!BG10","v":"X / 1"}]
[null,"Last 6",6,3,2,1,8,6,11,null,"50.0%"]
[null,"HT","Matches","Win","Draw","Loss","Scored","Conceded","Pts","Rank","Rate",null,"DEPLASMAN","O","G","B","M","A","Y","G","B","M","A","Y","AV","TOPL. PU","ORT. PU"]
[null,"Total",7,3,3,1,5,3,12,4,"42.9%",null,"GENEL",{"$f":"C21","v":9},3,2,4,8,6,{"$f":"IF(N10=0,0,O10/N10)","v":0.33333333333333331},{"$f":"IF(N10=0,0,P10/N10)","v":0.22222222222222221},{"$f":"IF(N10=0,0,Q10/N10)","v":0.44444444444444442},{"$f":"IF(N10=0,0,R10/N10)","v":0.88888888888888884},{"$f":"IF(N10=0,0,S10/N10)","v":0.66666666666666663},{"$f":"R10-S10","v":2},{"$f":"(O10*3)+(P10*1)+(Q10*0)","v":11},{"$f":"Z10/N10","v":1.2222222222222223}]
[null,"Home",3,1,2,0,2,1,5,8,"33.3%",null,"İÇERDE",4,2,1,1,4,1,{"$f":"IF(N11=0,0,O11/N11)","v":0.5},{"$f":"IF(N11=0,0,P11/N11)","v":0.25},{"$f":"IF(N11=0,0,Q11/N11)","v":0.25},{"$f":"IF(N11=0,0,R11/N11)","v":1},{"$f":"IF(N11=0,0,S11/N11)","v":0.25},{"$f":"R11-S11","v":3},{"$f":"(O11*3)+(P11*1)+(Q11*0)","v":7},{"$f":"Z11/N11","v":1.75}]
[null,"Away",4,2,1,1,3,2,7,2,"50.0%",null,"DIŞARDA",5,1,1,3,4,5,{"$f":"IF(N12=0,0,O12/N12)","v":0.2},{"$f":"IF(N12=0,0,P12/N12)","v":0.2},{"$f":"IF(N12=0,0,Q12/N12)","v":0.6},{"$f":"IF(N12=0,0,R12/N12)","v":0.8},{"$f":"IF(N12=0,0,S12/N12)","v":1},{"$f":"R12-S12","v":-1},{"$f":"(O12*3)+(P12*1)+(Q12*0)","v":4},{"$f":"Z12/N12","v":0.8}]
[null,"Last 6",6,3,2,1,5,3,11,null,"50.0%",null,"SON 6 MAÇ",6,3,0,3,8,5,{"$f":"IF(N13=0,0,O13/N13)","v":0.5},{"$f":"IF(N13=0,0,P13/N13)","v":0},{"$f":"IF(N13=0,0,Q13/N13)","v":0.5},{"$f":"IF(N13=0,0,R13/N13)","v":1.3333333333333333},{"$f":"IF(N13=0,0,S13/N13)","v":0.83333333333333337},{"$f":"R13-S13","v":3},{"$f":"(O13*3)+(P13*1)+(Q13*0)","v":9},{"$f":"Z13/N13","v":1.5}]
[null,"[5]   Edgeworth Eagles FC"]
[null,"FT","Matches","Win","Draw","Loss","Scored","Conceded","Pts","Rank","Rate",null,"MAÇ SONUCU"]
[null,"Total",9,4,1,4,14,16,13,5,"44.4%",null,"EV SAHİBİ","O","G","B","M","A","Y","G","B","M","A","Y","AV","TOPL. PU","ORT. PU"]
[null,"Home",4,2,1,1,6,4,7,5,"50.0%",null,"GENEL",{"$f":"C5","v":7},4,2,1,10,7,{"$f":"IF(N17=0,0,O17/N17)","v":0.5714285714285714},{"$f":"IF(N17=0,0,P17/N17)","v":0.2857142857142857},{"$f":"IF(N17=0,0,Q17/N17)","v":0.14285714285714285},{"$f":"IF(N17=0,0,R17/N17)","v":1.4285714285714286},{"$f":"IF(N17=0,0,S17/N17)","v":1},{"$f":"R17-S17","v":3},{"$f":"(O17*3)+(P17*1)+(Q17*0)","v":14},{"$f":"Z17/N17","v":2}]
[null,"Away",5,2,0,3,8,12,6,5,"40.0%",null,"İÇERDE",3,1,2,0,4,3,{"$f":"IF(N18=0,0,O18/N18)","v":0.33333333333333331},{"$f":"IF(N18=0,0,P18/N18)","v":0.66666666666666663},{"$f":"IF(N18=0,0,Q18/N18)","v":0},{"$f":"IF(N18=0,0,R18/N18)","v":1.3333333333333333},{"$f":"IF(N18=0,0,S18/N18)","v":1},{"$f":"R18-S18","v":1},{"$f":"(O18*3)+(P18*1)+(Q18*0)","v":5},{"$f":"Z18/N18","v":1.6666666666666667}]
[null,"Last 6",6,3,1,2,12,11,10,null,"50.0%",null,"DIŞARDA",4,3,0,1,6,4,{"$f":"IF(N19=0,0,O19/N19)","v":0.75},{"$f":"IF(N19=0,0,P19/N19)","v":0},{"$f":"IF(N19=0,0,Q19/N19)","v":0.25},{"$f":"IF(N19=0,0,R19/N19)","v":1.5},{"$f":"IF(N19=0,0,S19/N19)","v":1},{"$f":"R19-S19","v":2},{"$f":"(O19*3)+(P19*1)+(Q19*0)","v":9},{"$f":"Z19/N19","v":2.25}]
[null,"HT","Matches","Win","Draw","Loss","Scored","Conceded","Pts","Rank","Rate",null,"SON 6 MAÇ",6,3,2,1,8,6,{"$f":"IF(N20=0,0,O20/N20)","v":0.5},{"$f":"IF(N20=0,0,P20/N20)","v":0.33333333333333331},{"$f":"IF(N20=0,0,Q20/N20)","v":0.16666666666666666},{"$f":"IF(N20=0,0,R20/N20)","v":1.3333333333333333},{"$f":"IF(N20=0,0,S20/N20)","v":1},{"$f":"R20-S20","v":2},{"$f":"(O20*3)+(P20*1)+(Q20*0)","v":11},{"$f":"Z20/N20","v":1.8333333333333333}]
[null,"Total",9,3,2,4,8,6,11,6,"33.3%"]
[null,"Home",4,2,1,1,4,1,7,5,"50.0%",null,"DEPLASMAN","O","G","B","M","A","Y","G","B","M","A","Y","AV","TOPL. PU","ORT. PU"]
[null,"Away",5,1,1,3,4,5,4,7,"20.0%",null,"GENEL",{"$f":"C16","v":9},4,1,4,14,16,{"$f":"IF(N23=0,0,O23/N23)","v":0.44444444444444442},{"$f":"IF(N23=0,0,P23/N23)","v":0.1111111111111111},{"$f":"IF(N23=0,0,Q23/N23)","v":0.44444444444444442},{"$f":"IF(N23=0,0,R23/N23)","v":1.5555555555555556},{"$f":"IF(N23=0,0,S23/N23)","v":1.7777777777777777},{"$f":"R23-S23","v":-2},{"$f":"(O23*3)+(P23*1)+(Q23*0)","v":13},{"$f":"Z23/N23","v":1.4444444444444444}]
[null,"Last 6",6,3,0,3,8,5,9,null,"50.0%",null,"İÇERDE",4,2,1,1,6,4,{"$f":"IF(N24=0,0,O24/N24)","v":0.5},{"$f":"IF(N24=0,0,P24/N24)","v":0.25},{"$f":"IF(N24=0,0,Q24/N24)","v":0.25},{"$f":"IF(N24=0,0,R24/N24)","v":1.5},{"$f":"IF(N24=0,0,S24/N24)","v":1},{"$f":"R24-S24","v":2},{"$f":"(O24*3)+(P24*1)+(Q24*0)","v":7},{"$f":"Z24/N24","v":1.75}]
[null,null,null,null,null,null,null,null,null,null,null,null,"DIŞARDA",5,2,0,3,8,12,{"$f":"IF(N25=0,0,O25/N25)","v":0.4},{"$f":"IF(N25=0,0,P25/N25)","v":0},{"$f":"IF(N25=0,0,Q25/N25)","v":0.6},{"$f":"IF(N25=0,0,R25/N25)","v":1.6},{"$f":"IF(N25=0,0,S25/N25)","v":2.4},{"$f":"R25-S25","v":-4},{"$f":"(O25*3)+(P25*1)+(Q25*0)","v":6},{"$f":"Z25/N25","v":1.2}]
[null,null,null,null,null,null,null,null,null,null,null,null,"SON 6 MAÇ",6,3,1,2,12,11,{"$f":"IF(N26=0,0,O26/N26)","v":0.5},{"$f":"IF(N26=0,0,P26/N26)","v":0.16666666666666666},{"$f":"IF(N26=0,0,Q26/N26)","v":0.33333333333333331},{"$f":"IF(N26=0,0,R26/N26)","v":2},{"$f":"IF(N26=0,0,S26/N26)","v":1.8333333333333333},{"$f":"R26-S26","v":1},{"$f":"(O26*3)+(P26*1)+(Q26*0)","v":10},{"$f":"Z26/N26","v":1.6666666666666667}]

{"sheet":"Most","index":4,"n_rows":57,"n_cols":45,"rows_kept":57,"cut":false,"hidden":false,"merged":[[19,6,21,9],[16,6,18,9],[19,11,21,14],[16,11,18,14],[10,6,10,7],[10,8,10,9],[10,11,10,12],[10,13,10,14],[11,6,14,7],[11,8,14,9],[11,11,14,12],[11,13,14,14],[4,9,4,11],[5,9,5,11],[6,9,6,11],[7,9,7,11],[9,6,9,9],[9,11,9,14],[3,3,3,4],[3,9,3,11],[3,18,3,19],[0,6,0,14],[1,1,1,4],[1,6,1,14],[1,16,1,19],[2,6,2,14]]}
[null,null,null,null,null,null,"PIF  -  EIF  *  08.06.2022  / 12:00  *  Avustralya-Ulusal Premier Lig Kuzey YGG",null,null,null,null,null,null,null,null,null,null,null,null,null,null,null,null,null,null,null,null,null,null,null,null,null,null,null,"Tarih","EvSahibi","MS","Deplasman","İY",null,"Tarih","EvSahibi","MS","Deplasman","İY"]
[null,{"$f":"G11","v":"Lambton Jaffas"},null,null,null,null,"PLAYER",null,null,null,null,null,null,null,null,null,{"$f":"N11","v":"Edgeworth Eagles"},null,null,null,null,null,null,null,null,null,null,null,null,null,null,null,null,{"$f":"Veri2!A116","v":"D"},{"$f":"Veri2!B116","v":"2022-06-04"},{"$f":"Veri2!C116","v":"Lambton Jaffas"},{"$f":"IF(Veri2!D116=\"\",\"0 - 0\",Veri2!D116)","v":"1 - 1"},{"$f":"Veri2!E116","v":"Weston Bears"},{"$f":"IF(Veri2!F116=\"\",\"0-0\",Veri2!F116)","v":"1-0"},{"$f":"Veri2!A150","v":"D"},{"$f":"Veri2!B150","v":"2022-05-29"},{"$f":"Veri2!C150","v":"Valentine Phoenix"},{"$f":"IF(Veri2!D150=\"\",\"0 - 0\",Veri2!D150)","v":"1 - 0"},{"$f":"Veri2!E150","v":"Edgeworth Eagles"},{"$f":"IF(Veri2!F150=\"\",\"0-0\",Veri2!F150)","v":"1-0"}]
[null,null,null,null,null,null,"http://betistuta.club/Futbol.aspx",null,null,null,null,null,null,null,null,null,null,null,null,null,null,null,null,null,null,null,null,null,null,null,null,null,null,{"$f":"Veri2!A117","v":"D"},{"$f":"Veri2!B117","v":"2022-05-04"},{"$f":"Veri2!C117","v":"Lambton Jaffas"},{"$f":"IF(Veri2!D117=\"\",\"0 - 0\",Veri2!D117)","v":"1 - 1"},{"$f":"Veri2!E117","v":"Newcastle Olympic"},{"$f":"IF(Veri2!F117=\"\",\"0-0\",Veri2!F117)","v":"1-1"},{"$f":"Veri2!A151","v":"D"},{"$f":"Veri2!B151","v":"2022-05-01"},{"$f":"Veri2!C151","v":"Lake Macquarie"},{"$f":"IF(Veri2!D151=\"\",\"0 - 0\",Veri2!D151)","v":"2 - 4"},{"$f":"Veri2!E151","v":"Edgeworth Eagles"},{"$f":"IF(Veri2!F151=\"\",\"0-0\",Veri2!F151)","v":"0-3"}]
[null,{"$f":"G11","v":"Lambton Jaffas"},{"$f":"I11","v":"Edgeworth Eagles"},"Ortalama",null,null,null,null,null,"UNDER / OVER",null,null,null,null,null,null,{"$f":"L11","v":"Lambton Jaffas"},{"$f":"N11","v":"Edgeworth Eagles"},"Ortalama",null,null,null,null,null,null,null,null,null,null,null,null,null,null,{"$f":"Veri2!A118","v":"D"},{"$f":"Veri2!B118","v":"2022-03-20"},{"$f":"Veri2!C118","v":"Lambton Jaffas"},{"$f":"IF(Veri2!D118=\"\",\"0 - 0\",Veri2!D118)","v":"2 - 1"},{"$f":"Veri2!E118","v":"Broadmeadow Magic"},{"$f":"IF(Veri2!F118=\"\",\"0-0\",Veri2!F118)","v":"0-0"},{"$f":"Veri2!A152","v":"D"},{"$f":"Veri2!B152","v":"2022-04-10"},{"$f":"Veri2!C152","v":"Charlestown City B"},{"$f":"IF(Veri2!D152=\"\",\"0 - 0\",Veri2!D152)","v":"6 - 2"},{"$f":"Veri2!E152","v":"Edgeworth Eagles"},{"$f":"IF(Veri2!F152=\"\",\"0-0\",Veri2!F152)","v":"3-1"}]
[null,{"$f":"AK43+0.005","v":0.60499999999999998},{"$f":"AQ43+0.005","v":1.0049999999999999},"gPS","Number of Positions Entered",null,null,null,null,"BTTS / KARŞILIKLI GOL",null,null,null,null,null,null,{"$f":"AI57+0.005","v":2.2050000000000001},{"$f":"AO57+0.005","v":2.4049999999999998},"gPS","Number of Positions Entered",null,null,null,null,null,null,null,null,null,null,null,null,null,{"$f":"Veri2!A119","v":"D"},{"$f":"Veri2!B119","v":"2021-08-01"},{"$f":"Veri2!C119","v":"Lambton Jaffas"},{"$f":"IF(Veri2!D119=\"\",\"0 - 0\",Veri2!D119)","v":"2 - 1"},{"$f":"Veri2!E119","v":"Broadmeadow Magic"},{"$f":"IF(Veri2!F119=\"\",\"0-0\",Veri2!F119)","v":"1-0"},{"$f":"Veri2!A153","v":"D"},{"$f":"Veri2!B153","v":"2022-04-02"},{"$f":"Veri2!C153","v":"Broadmeadow Magic"},{"$f":"IF(Veri2!D153=\"\",\"0 - 0\",Veri2!D153)","v":"3 - 1"},{"$f":"Veri2!E153","v":"Edgeworth Eagles"},{"$f":"IF(Veri2!F153=\"\",\"0-0\",Veri2!F153)","v":"1-0"}]
[null,{"$f":"AL43+0.005","v":0.20500000000000002},{"$f":"AR43+0.005","v":0.80500000000000005},"vPS","Number of Positions Given",null,null,null,null,{"$f":"IF(AND(Q22>=1,R22>=1),\"VAR\",\"YOK\")","v":"VAR"},null,null,null,null,null,null,{"$f":"AJ57+0.005","v":1.0049999999999999},{"$f":"AP57+0.005","v":1.605},"vPS","Number of Positions Given",null,null,null,null,null,null,null,null,null,null,null,null,null,{"$f":"Veri2!A120","v":"D"},{"$f":"Veri2!B120","v":"2021-07-10"},{"$f":"Veri2!C120","v":"Lambton Jaffas"},{"$f":"IF(Veri2!D120=\"\",\"0 - 0\",Veri2!D120)","v":"5 - 1"},{"$f":"Veri2!E120","v":"Adamstown Rosebuds"},{"$f":"IF(Veri2!F120=\"\",\"0-0\",Veri2!F120)","v":"0-0"},{"$f":"Veri2!A154","v":"D"},{"$f":"Veri2!B154","v":"2022-03-12"},{"$f":"Veri2!C154","v":"Adamstown Rosebuds"},{"$f":"IF(Veri2!D154=\"\",\"0 - 0\",Veri2!D154)","v":"0 - 1"},{"$f":"Veri2!E154","v":"Edgeworth Eagles"},{"$f":"IF(Veri2!F154=\"\",\"0-0\",Veri2!F154)","v":"0-0"}]
[null,{"$f":"((B5+1)/(B6+1))+0.005","v":1.3369502074688795},{"$f":"((C5+1)/(C6+1))+0.005","v":1.1158033240997227},"pBAS","Number Per Position",null,null,null,null,"HT / FT",null,null,null,null,null,null,{"$f":"((Q5+1)/(Q6+1))+0.005","v":1.603503740648379},{"$f":"((R5+1)/(R6+1))+0.005","v":1.3121017274472166},"pBAS","Number Per Position",null,null,null,null,null,null,null,null,null,null,null,null,null,{"$f":"Veri2!A121","v":"D"},{"$f":"Veri2!B121","v":"2021-06-05"},{"$f":"Veri2!C121","v":"Lambton Jaffas"},{"$f":"IF(Veri2!D121=\"\",\"0 - 0\",Veri2!D121)","v":"4 - 1"},{"$f":"Veri2!E121","v":"Weston Bears"},{"$f":"IF(Veri2!F121=\"\",\"0-0\",Veri2!F121)","v":"2-1"},{"$f":"Veri2!A155","v":"D"},{"$f":"Veri2!B155","v":"2021-07-04"},{"$f":"Veri2!C155","v":"Newcastle Olympic"},{"$f":"IF(Veri2!D155=\"\",\"0 - 0\",Veri2!D155)","v":"1 - 2"},{"$f":"Veri2!E155","v":"Edgeworth Eagles"},{"$f":"IF(Veri2!F155=\"\",\"0-0\",Veri2!F155)","v":"0-2"}]
[null,{"$f":"((B6+1)/(B5+1))+0.005","v":0.75577881619937703},{"$f":"((C6+1)/(C5+1))+0.005","v":0.9052493765586036},"pBYS","Number Eats Per Position",null,null,null,null,{"$f":"IF(AND((G12>I12),(L12>N12)),\"1 / 1\",IF(AND((G12=I12),(L12>N12)),\"X / 1\",IF(AND((G12<I12),(L12>N12)),\"2 / 1\",IF(AND((G12>I12),(L12=N12)),\"1 / X\",IF(AND((G12=I12),(L12=N12)),\"X / X\",IF(AND((G12<I12),(L12=N12)),\"2 / X\",IF(AND((G12>I12),(L12<N12)),\"1 / 2\",IF(AND((G12=I12),(L12<N12)),\"X / 2\",IF(AND((G12<I12),(L12<N12)),\"2 / 2\")))))))))","v":"X / 1"},null,null,null,null,null,null,{"$f":"((Q6+1)/(Q5+1))+0.005","v":0.63058502340093603},{"$f":"((R6+1)/(R5+1))+0.005","v":0.77005139500734221},"pBYS","Number Eats Per Position",null,null,null,null,null,null,null,null,null,null,null,null,null,{"$f":"Veri2!A122","v":"D"},{"$f":"Veri2!B122","v":"2021-05-29"},{"$f":"Veri2!C122","v":"Lambton Jaffas"},{"$f":"IF(Veri2!D122=\"\",\"0 - 0\",Veri2!D122)","v":"2 - 1"},{"$f":"Veri2!E122","v":"Maitland"},{"$f":"IF(Veri2!F122=\"\",\"0-0\",Veri2!F122)","v":"1-1"},{"$f":"Veri2!A156","v":"D"},{"$f":"Veri2!B156","v":"2021-06-05"},{"$f":"Veri2!C156","v":"Maitland"},{"$f":"IF(Veri2!D156=\"\",\"0 - 0\",Veri2!D156)","v":"2 - 4"},{"$f":"Veri2!E156","v":"Edgeworth Eagles"},{"$f":"IF(Veri2!F156=\"\",\"0-0\",Veri2!F156)","v":"2-1"}]
[null,null,null,null,null,null,{"$f":"CONCATENATE(G12,\" - \",I12)","v":"1 - 1"},{"$f":"LEFT(J8,1)","v":"X"},null,null,null,null,null,{"$f":"RIGHT(J8,2)","v":" 1"},{"$f":"CONCATENATE(L12,\" - \",N12)","v":"2 - 1"},null,null,null,null,null,null,null,null,null,null,null,null,null,null,null,null,null,null,{"$f":"Veri2!A123","v":"D"},{"$f":"Veri2!B123","v":"2021-05-08"},{"$f":"Veri2!C123","v":"Lambton Jaffas"},{"$f":"IF(Veri2!D123=\"\",\"0 - 0\",Veri2!D123)","v":"1 - 2"},{"$f":"Veri2!E123","v":"Newcastle Olympic"},{"$f":"IF(Veri2!F123=\"\",\"0-0\",Veri2!F123)","v":"1-0"},{"$f":"Veri2!A157","v":"D"},{"$f":"Veri2!B157","v":"2021-05-30"},{"$f":"Veri2!C157","v":"Broadmeadow Magic"},{"$f":"IF(Veri2!D157=\"\",\"0 - 0\",Veri2!D157)","v":"2 - 1"},{"$f":"Veri2!E157","v":"Edgeworth Eagles"},{"$f":"IF(Veri2!F157=\"\",\"0-0\",Veri2!F157)","v":"1-0"}]
[null,"Max A","Max B","Min A","Min B",null,"HT / İLK YARI",null,null,null,null,"FT / MAÇ SONU",null,null,null,null,"Max A","Max B","Min A","Min B",null,null,null,null,null,null,null,null,null,null,null,null,null,{"$f":"Veri2!A124","v":"D"},{"$f":"Veri2!B124","v":"2021-04-17"},{"$f":"Veri2!C124","v":"Lambton Jaffas"},{"$f":"IF(Veri2!D124=\"\",\"0 - 0\",Veri2!D124)","v":"2 - 1"},{"$f":"Veri2!E124","v":"Lake Macquarie"},{"$f":"IF(Veri2!F124=\"\",\"0-0\",Veri2!F124)","v":"1-1"},{"$f":"Veri2!A158","v":"D"},{"$f":"Veri2!B158","v":"2021-05-16"},{"$f":"Veri2!C158","v":"Valentine Phoenix"},{"$f":"IF(Veri2!D158=\"\",\"0 - 0\",Veri2!D158)","v":"0 - 4"},{"$f":"Veri2!E158","v":"Edgeworth Eagles"},{"$f":"IF(Veri2!F158=\"\",\"0-0\",Veri2!F158)","v":"0-2"}]
[null,{"$f":"MAX(C6,B5)+0.005","v":0.81},{"$f":"MAX(C5,B6)+0.005","v":1.0099999999999998},{"$f":"MIN(C6,B5)+0.005","v":0.61},{"$f":"MIN(C5,B6)+0.005","v":0.21000000000000002},null,{"$f":"AJ2","v":"Lambton Jaffas"},null,{"$f":"AR2","v":"Edgeworth Eagles"},null,null,{"$f":"G11","v":"Lambton Jaffas"},null,{"$f":"I11","v":"Edgeworth Eagles"},null,null,{"$f":"MAX(R6,Q5)+0.005","v":2.21},{"$f":"MAX(R5,Q6)+0.005","v":2.4099999999999997},{"$f":"MIN(R6,Q5)+0.005","v":1.6099999999999999},{"$f":"MIN(R5,Q6)+0.005","v":1.0099999999999998},null,null,null,null,null,null,null,null,null,null,null,null,null,{"$f":"Veri2!A125","v":"D"},{"$f":"Veri2!B125","v":"2021-04-11"},{"$f":"Veri2!C125","v":"Lambton Jaffas"},{"$f":"IF(Veri2!D125=\"\",\"0 - 0\",Veri2!D125)","v":"1 - 0"},{"$f":"Veri2!E125","v":"Valentine Phoenix"},{"$f":"IF(Veri2!F125=\"\",\"0-0\",Veri2!F125)","v":"0-0"},{"$f":"Veri2!A159","v":"D"},{"$f":"Veri2!B159","v":"2021-04-24"},{"$f":"Veri2!C159","v":"Charlestown City B"},{"$f":"IF(Veri2!D159=\"\",\"0 - 0\",Veri2!D159)","v":"0 - 2"},{"$f":"Veri2!E159","v":"Edgeworth Eagles"},{"$f":"IF(Veri2!F159=\"\",\"0-0\",Veri2!F159)","v":"0-0"}]
[null,{"$f":"MAX(B7,C8)+0.005","v":1.3419502074688794},{"$f":"MAX(C7,B8)+0.005","v":1.1208033240997226},{"$f":"MIN(B7,C8)+0.005","v":0.91024937655860361},{"$f":"MIN(C7,B8)+0.005","v":0.76077881619937704},null,{"$f":"B22","v":1},null,{"$f":"C22","v":1},null,null,{"$f":"Q22","v":2},null,{"$f":"R22","v":1},null,null,{"$f":"MAX(Q7,R8)+0.005","v":1.6085037406483789},{"$f":"MAX(R7,Q8)+0.005","v":1.3171017274472165},{"$f":"MIN(Q7,R8)+0.005","v":0.77505139500734221},{"$f":"MIN(R7,Q8)+0.005","v":0.63558502340093603},null,null,null,null,null,null,null,null,null,null,null,null,null,{"$f":"Veri2!A126","v":"D"},{"$f":"Veri2!B126","v":"2021-04-02"},{"$f":"Veri2!C126","v":"Lambton Jaffas"},{"$f":"IF(Veri2!D126=\"\",\"0 - 0\",Veri2!D126)","v":"0 - 2"},{"$f":"Veri2!E126","v":"Edgeworth Eagles"},{"$f":"IF(Veri2!F126=\"\",\"0-0\",Veri2!F126)","v":"0-1"},{"$f":"Veri2!A160","v":"D"},{"$f":"Veri2!B160","v":"2021-04-11"},{"$f":"Veri2!C160","v":"Lake Macquarie"},{"$f":"IF(Veri2!D160=\"\",\"0 - 0\",Veri2!D160)","v":"3 - 2"},{"$f":"Veri2!E160","v":"Edgeworth Eagles"},{"$f":"IF(Veri2!F160=\"\",\"0-0\",Veri2!F160)","v":"1-2"}]
[null,{"$f":"B11*B12+0.005","v":1.0919796680497922},{"$f":"C11*C12+0.005","v":1.1370113573407195},{"$f":"D11*D12+0.005","v":0.56025211970074817},{"$f":"E11*E12+0.005","v":0.16476355140186918},null,null,null,null,null,null,null,null,null,null,null,{"$f":"Q11*Q12+0.005","v":3.5597932668329171},{"$f":"R11*R12+0.005","v":3.1792151631477914},{"$f":"S11*S12+0.005","v":1.2528327459618207},{"$f":"T11*T12+0.005","v":0.64694087363494523},null,null,null,null,null,null,null,null,null,null,null,null,null,{"$f":"Veri2!A127","v":"D"},{"$f":"Veri2!B127","v":"2020-09-26"},{"$f":"Veri2!C127","v":"Lambton Jaffas"},{"$f":"IF(Veri2!D127=\"\",\"0 - 0\",Veri2!D127)","v":"3 - 0"},{"$f":"Veri2!E127","v":"Lake Macquarie"},{"$f":"IF(Veri2!F127=\"\",\"0-0\",Veri2!F127)","v":"1-0"},{"$f":"Veri2!A161","v":"D"},{"$f":"Veri2!B161","v":"2021-04-02"},{"$f":"Veri2!C161","v":"Lambton Jaffas"},{"$f":"IF(Veri2!D161=\"\",\"0 - 0\",Veri2!D161)","v":"0 - 2"},{"$f":"Veri2!E161","v":"Edgeworth Eagles"},{"$f":"IF(Veri2!F161=\"\",\"0-0\",Veri2!F161)","v":"0-1"}]
[null,{"$f":"B13+0.005","v":1.0969796680497921},{"$f":"C13+0.005","v":1.1420113573407193},{"$f":"D13+0.005","v":0.56525211970074818},{"$f":"E13+0.005","v":0.16976355140186919},null,null,null,null,null,null,null,null,null,null,null,{"$f":"Q13+0.005","v":3.564793266832917},{"$f":"R13+0.005","v":3.1842151631477913},{"$f":"S13+0.005","v":1.2578327459618206},{"$f":"T13+0.005","v":0.65194087363494524},null,null,null,null,null,null,null,null,null,null,null,null,null,{"$f":"Veri2!A128","v":"D"},{"$f":"Veri2!B128","v":"2020-09-12"},{"$f":"Veri2!C128","v":"Lambton Jaffas"},{"$f":"IF(Veri2!D128=\"\",\"0 - 0\",Veri2!D128)","v":"0 - 0"},{"$f":"Veri2!E128","v":"Charlestown City B"},{"$f":"IF(Veri2!F128=\"\",\"0-0\",Veri2!F128)","v":"0-0"},{"$f":"Veri2!A162","v":"D"},{"$f":"Veri2!B162","v":"2020-09-26"},{"$f":"Veri2!C162","v":"Maitland"},{"$f":"IF(Veri2!D162=\"\",\"0 - 0\",Veri2!D162)","v":"2 - 1"},{"$f":"Veri2!E162","v":"Edgeworth Eagles"},{"$f":"IF(Veri2!F162=\"\",\"0-0\",Veri2!F162)","v":"0-1"}]
[null,{"$f":"G11","v":"Lambton Jaffas"},{"$f":"AVERAGE(B14,D14)+0.005","v":0.83611589387527008},{"$f":"I11","v":"Edgeworth Eagles"},{"$f":"AVERAGE(C14,E14)+0.005","v":0.66088745437129426},null,null,null,null,null,null,null,null,null,null,null,{"$f":"L11","v":"Lambton Jaffas"},{"$f":"AVERAGE(Q14,S14)+0.005","v":2.4163130063973686},{"$f":"N11","v":"Edgeworth Eagles"},{"$f":"AVERAGE(R14,T14)+0.005","v":1.9230780183913683},null,null,null,null,null,null,null,null,null,null,null,null,null,{"$f":"Veri2!A129","v":"D"},{"$f":"Veri2!B129","v":"2020-09-06"},{"$f":"Veri2!C129","v":"Lambton Jaffas"},{"$f":"IF(Veri2!D129=\"\",\"0 - 0\",Veri2!D129)","v":"3 - 1"},{"$f":"Veri2!E129","v":"Edgeworth Eagles"},{"$f":"IF(Veri2!F129=\"\",\"0-0\",Veri2!F129)","v":"3-1"},{"$f":"Veri2!A163","v":"D"},{"$f":"Veri2!B163","v":"2020-09-20"},{"$f":"Veri2!C163","v":"Hamilton Olympic"},{"$f":"IF(Veri2!D163=\"\",\"0 - 0\",Veri2!D163)","v":"1 - 3"},{"$f":"Veri2!E163","v":"Edgeworth Eagles"},{"$f":"IF(Veri2!F163=\"\",\"0-0\",Veri2!F163)","v":"0-1"}]
[null,null,null,null,null,null,null,null,null,null,null,null,null,null,null,null,null,null,null,null,null,null,null,null,null,null,null,null,null,null,null,null,null,{"$f":"Veri2!A130","v":"D"},{"$f":"Veri2!B130","v":"2020-08-22"},{"$f":"Veri2!C130","v":"Lambton Jaffas"},{"$f":"IF(Veri2!D130=\"\",\"0 - 0\",Veri2!D130)","v":"6 - 3"},{"$f":"Veri2!E130","v":"Adamstown Rosebuds"},{"$f":"IF(Veri2!F130=\"\",\"0-0\",Veri2!F130)","v":"3-1"},{"$f":"Veri2!A164","v":"D"},{"$f":"Veri2!B164","v":"2020-09-06"},{"$f":"Veri2!C164","v":"Lambton Jaffas"},{"$f":"IF(Veri2!D164=\"\",\"0 - 0\",Veri2!D164)","v":"3 - 1"},{"$f":"Veri2!E164","v":"Edgeworth Eagles"},{"$f":"IF(Veri2!F164=\"\",\"0-0\",Veri2!F164)","v":"3-1"}]
[null,"A_ort","B_ort","Mean A","Mean B",null,{"$f":"IF(AND(SUM(B22,C22)>0,SUM(B22,C22)<2),\"0.5 GOL ÜST\",IF(AND(SUM(B22,C22)>=2,SUM(B22,C22)<3),\"1.5 GOL ÜST\",IF(AND(SUM(B22,C22)>=3,SUM(B22,C22)<4),\"2.5 GOL ÜST\",IF(AND(SUM(B22,C22)>=4,SUM(B22,C22)<5),\"3.5 GOL ÜST\",IF(AND(SUM(B22,C22)>=5,SUM(B22,C22)<6),\"4.5 GOL ÜST\",IF(AND(SUM(B22,C22)>=6,SUM(B22,C22)<7),\"5.5 GOL ÜST\",IF(AND(SUM(B22,C22)>=7,SUM(B22,C22)<8),\"6.5 GOL ÜST\",IF(SUM(B22,C22)>=8,\"7+ GOL ÜST\",\"BAHİS OYNAMA\"))))))))","v":"1.5 GOL ÜST"},null,null,null,null,{"$f":"IF(AND(SUM(Q22,R22)>0,SUM(Q22,R22)<2),\"0.5 GOL ÜST\",IF(AND(SUM(Q22,R22)>=2,SUM(Q22,R22)<3),\"1.5 GOL ÜST\",IF(AND(SUM(Q22,R22)>=3,SUM(Q22,R22)<4),\"2.5 GOL ÜST\",IF(AND(SUM(Q22,R22)>=4,SUM(Q22,R22)<5),\"3.5 GOL ÜST\",IF(AND(SUM(Q22,R22)>=5,SUM(Q22,R22)<6),\"4.5 GOL ÜST\",IF(AND(SUM(Q22,R22)>=6,SUM(Q22,R22)<7),\"5.5 GOL ÜST\",IF(AND(SUM(Q22,R22)>=7,SUM(Q22,R22)<8),\"6.5 GOL ÜST\",IF(SUM(Q22,R22)>=8,\"7+ GOL ÜST\",\"BAHİS OYNAMA\"))))))))","v":"2.5 GOL ÜST"},null,null,null,null,"A_ort","B_ort","Mean A","Mean B",null,null,null,null,null,null,null,null,null,null,null,null,null,{"$f":"Veri2!A131","v":"D"},{"$f":"Veri2!B131","v":"2020-08-08"},{"$f":"Veri2!C131","v":"Lambton Jaffas"},{"$f":"IF(Veri2!D131=\"\",\"0 - 0\",Veri2!D131)","v":"2 - 3"},{"$f":"Veri2!E131","v":"Broadmeadow Magic"},{"$f":"IF(Veri2!F131=\"\",\"0-0\",Veri2!F131)","v":"0-0"},{"$f":"Veri2!A165","v":"D"},{"$f":"Veri2!B165","v":"2020-08-23"},{"$f":"Veri2!C165","v":"Valentine Phoenix"},{"$f":"IF(Veri2!D165=\"\",\"0 - 0\",Veri2!D165)","v":"0 - 2"},{"$f":"Veri2!E165","v":"Edgeworth Eagles"},{"$f":"IF(Veri2!F165=\"\",\"0-0\",Veri2!F165)","v":"0-0"}]
[null,{"$f":"B5*B7+0.005","v":0.81385487551867208},{"$f":"C5*C7+0.005","v":1.1263823407202211},{"$f":"B7+0.005","v":1.3419502074688794},{"$f":"C7+0.005","v":1.1208033240997226},null,null,null,null,null,null,null,null,null,null,null,{"$f":"Q5*Q7+0.005","v":3.5407257481296757},{"$f":"R5*R7+0.005","v":3.1606046545105557},{"$f":"Q7+0.005","v":1.6085037406483789},{"$f":"R7+0.005","v":1.3171017274472165},null,null,null,null,null,null,null,null,null,null,null,null,null,{"$f":"Veri2!A132","v":"D"},{"$f":"Veri2!B132","v":"2020-08-01"},{"$f":"Veri2!C132","v":"Lambton Jaffas"},{"$f":"IF(Veri2!D132=\"\",\"0 - 0\",Veri2!D132)","v":"2 - 2"},{"$f":"Veri2!E132","v":"Hamilton Olympic"},{"$f":"IF(Veri2!F132=\"\",\"0-0\",Veri2!F132)","v":"2-1"},{"$f":"Veri2!A166","v":"D"},{"$f":"Veri2!B166","v":"2020-08-09"},{"$f":"Veri2!C166","v":"Lake Macquarie"},{"$f":"IF(Veri2!D166=\"\",\"0 - 0\",Veri2!D166)","v":"0 - 3"},{"$f":"Veri2!E166","v":"Edgeworth Eagles"},{"$f":"IF(Veri2!F166=\"\",\"0-0\",Veri2!F166)","v":"0-3"}]
[null,{"$f":"B5*C8+0.005","v":0.55267587281795516},{"$f":"C5*B8+0.005","v":0.76455771028037389},{"$f":"B7+0.005","v":1.3419502074688794},{"$f":"C7+0.005","v":1.1208033240997226},null,null,null,null,null,null,null,null,null,null,null,{"$f":"Q5*R8+0.005","v":1.7029633259911896},{"$f":"R5*Q8+0.005","v":1.5215569812792509},{"$f":"Q7+0.005","v":1.6085037406483789},{"$f":"R7+0.005","v":1.3171017274472165},null,null,null,null,null,null,null,null,null,null,null,null,null,{"$f":"Veri2!A133","v":"D"},{"$f":"Veri2!B133","v":"2020-07-18"},{"$f":"Veri2!C133","v":"Lambton Jaffas"},{"$f":"IF(Veri2!D133=\"\",\"0 - 0\",Veri2!D133)","v":"2 - 3"},{"$f":"Veri2!E133","v":"Weston Bears"},{"$f":"IF(Veri2!F133=\"\",\"0-0\",Veri2!F133)","v":"2-2"},{"$f":"Veri2!A167","v":"D"},{"$f":"Veri2!B167","v":"2020-08-02"},{"$f":"Veri2!C167","v":"Broadmeadow Magic"},{"$f":"IF(Veri2!D167=\"\",\"0 - 0\",Veri2!D167)","v":"0 - 1"},{"$f":"Veri2!E167","v":"Edgeworth Eagles"},{"$f":"IF(Veri2!F167=\"\",\"0-0\",Veri2!F167)","v":"0-0"}]
[null,{"$f":"C6*B7+0.005","v":1.0812449170124478},{"$f":"B6*C7+0.005","v":0.23373968144044319},{"$f":"B8+0.005","v":0.76077881619937704},{"$f":"C8+0.005","v":0.91024937655860361},null,{"$f":"Veri2!AX93","v":"İY1"},null,null,null,null,{"$f":"Veri2!AJ93","v":"MS1"},null,null,null,null,{"$f":"R6*Q7+0.005","v":2.5786235037406482},{"$f":"Q6*R7+0.005","v":1.3236622360844525},{"$f":"Q8+0.005","v":0.63558502340093603},{"$f":"R8+0.005","v":0.77505139500734221},null,null,null,null,null,null,null,null,null,null,null,null,null,{"$f":"Veri2!A134","v":"D"},{"$f":"Veri2!B134","v":"2019-08-25"},{"$f":"Veri2!C134","v":"Lambton Jaffas"},{"$f":"IF(Veri2!D134=\"\",\"0 - 0\",Veri2!D134)","v":"3 - 0"},{"$f":"Veri2!E134","v":"Edgeworth Eagles"},{"$f":"IF(Veri2!F134=\"\",\"0-0\",Veri2!F134)","v":"2-0"},{"$f":"Veri2!A168","v":"D"},{"$f":"Veri2!B168","v":"2020-07-19"},{"$f":"Veri2!C168","v":"Adamstown Rosebuds"},{"$f":"IF(Veri2!D168=\"\",\"0 - 0\",Veri2!D168)","v":"1 - 3"},{"$f":"Veri2!E168","v":"Edgeworth Eagles"},{"$f":"IF(Veri2!F168=\"\",\"0-0\",Veri2!F168)","v":"0-2"}]
[null,{"$f":"C6*B8+0.005","v":0.61340194704049855},{"$f":"B6*C8+0.005","v":0.19057612219451375},{"$f":"B8+0.005","v":0.76077881619937704},{"$f":"C8+0.005","v":0.91024937655860361},null,null,null,null,null,null,null,null,null,null,null,{"$f":"R6*R8+0.005","v":1.2409324889867841},{"$f":"Q6*Q8+0.005","v":0.63873794851794063},{"$f":"Q8+0.005","v":0.63558502340093603},{"$f":"R8+0.005","v":0.77505139500734221},null,null,null,null,null,null,null,null,null,null,null,null,null,{"$f":"Veri2!A135","v":"D"},{"$f":"Veri2!B135","v":"2019-08-07"},{"$f":"Veri2!C135","v":"Lambton Jaffas"},{"$f":"IF(Veri2!D135=\"\",\"0 - 0\",Veri2!D135)","v":"1 - 1"},{"$f":"Veri2!E135","v":"Maitland"},{"$f":"IF(Veri2!F135=\"\",\"0-0\",Veri2!F135)","v":"1-1"},{"$f":"Veri2!A169","v":"D"},{"$f":"Veri2!B169","v":"2019-08-25"},{"$f":"Veri2!C169","v":"Lambton Jaffas"},{"$f":"IF(Veri2!D169=\"\",\"0 - 0\",Veri2!D169)","v":"3 - 0"},{"$f":"Veri2!E169","v":"Edgeworth Eagles"},{"$f":"IF(Veri2!F169=\"\",\"0-0\",Veri2!F169)","v":"2-0"}]
[null,{"$f":"ROUND(AVERAGE(B18:B21),0)","v":1},{"$f":"ROUND(AVERAGE(C18:C21),0)","v":1},{"$f":"ROUND(AVERAGE(D18:D21),0)","v":1},1,null,null,null,null,null,null,null,null,null,null,null,{"$f":"ROUNDDOWN(AVERAGE(Q18:Q21),0)","v":2},{"$f":"ROUNDDOWN(AVERAGE(R18:R21),0)","v":1},{"$f":"ROUND(AVERAGE(S18:S21),0)","v":1},1,null,null,null,null,null,null,null,null,null,null,null,null,null,{"$f":"Veri2!A136","v":"D"},{"$f":"Veri2!B136","v":"2019-08-03"},{"$f":"Veri2!C136","v":"Lambton Jaffas"},{"$f":"IF(Veri2!D136=\"\",\"0 - 0\",Veri2!D136)","v":"2 - 0"},{"$f":"Veri2!E136","v":"Broadmeadow Magic"},{"$f":"IF(Veri2!F136=\"\",\"0-0\",Veri2!F136)","v":"0-0"},{"$f":"Veri2!A170","v":"D"},{"$f":"Veri2!B170","v":"2019-08-04"},{"$f":"Veri2!C170","v":"Valentine Phoenix"},{"$f":"IF(Veri2!D170=\"\",\"0 - 0\",Veri2!D170)","v":"3 - 1"},{"$f":"Veri2!E170","v":"Edgeworth Eagles"},{"$f":"IF(Veri2!F170=\"\",\"0-0\",Veri2!F170)","v":"1-0"}]
[null,null,null,null,null,null,null,null,null,null,null,null,null,null,null,null,null,null,null,null,null,null,null,null,null,null,null,null,null,null,null,null,null,{"$f":"Veri2!A137","v":"D"},{"$f":"Veri2!B137","v":"2019-07-27"},{"$f":"Veri2!C137","v":"Lambton Jaffas"},{"$f":"IF(Veri2!D137=\"\",\"0 - 0\",Veri2!D137)","v":"3 - 0"},{"$f":"Veri2!E137","v":"Newcastle Jets II"},{"$f":"IF(Veri2!F137=\"\",\"0-0\",Veri2!F137)","v":"1-0"},{"$f":"Veri2!A171","v":"D"},{"$f":"Veri2!B171","v":"2019-07-24"},{"$f":"Veri2!C171","v":"Darwin Olympic"},{"$f":"IF(Veri2!D171=\"\",\"0 - 0\",Veri2!D171)","v":"0 - 3"},{"$f":"Veri2!E171","v":"Edgeworth Eagles"},{"$f":"IF(Veri2!F171=\"\",\"0-0\",Veri2!F171)","v":"0-2"}]
[null,null,null,null,null,null,null,null,null,null,null,null,null,null,null,null,null,null,null,null,null,null,null,null,null,null,null,null,null,null,null,null,null,{"$f":"Veri2!A138","v":"D"},{"$f":"Veri2!B138","v":"2019-07-13"},{"$f":"Veri2!C138","v":"Lambton Jaffas"},{"$f":"IF(Veri2!D138=\"\",\"0 - 0\",Veri2!D138)","v":"5 - 2"},{"$f":"Veri2!E138","v":"Valentine Phoenix"},{"$f":"IF(Veri2!F138=\"\",\"0-0\",Veri2!F138)","v":"4-2"},{"$f":"Veri2!A172","v":"D"},{"$f":"Veri2!B172","v":"2019-07-13"},{"$f":"Veri2!C172","v":"Adamstown Rosebuds"},{"$f":"IF(Veri2!D172=\"\",\"0 - 0\",Veri2!D172)","v":"0 - 1"},{"$f":"Veri2!E172","v":"Edgeworth Eagles"},{"$f":"IF(Veri2!F172=\"\",\"0-0\",Veri2!F172)","v":"0-1"}]
[null,null,null,null,null,null,null,null,null,null,null,null,null,null,null,null,null,null,null,null,null,null,null,null,null,null,null,null,null,null,null,null,null,{"$f":"Veri2!A139","v":"D"},{"$f":"Veri2!B139","v":"2019-06-15"},{"$f":"Veri2!C139","v":"Lambton Jaffas"},{"$f":"IF(Veri2!D139=\"\",\"0 - 0\",Veri2!D139)","v":"2 - 0"},{"$f":"Veri2!E139","v":"Hamilton Olympic"},{"$f":"IF(Veri2!F139=\"\",\"0-0\",Veri2!F139)","v":"2-0"},{"$f":"Veri2!A173","v":"D"},{"$f":"Veri2!B173","v":"2019-07-06"},{"$f":"Veri2!C173","v":"Hamilton Olympic"},{"$f":"IF(Veri2!D173=\"\",\"0 - 0\",Veri2!D173)","v":"1 - 4"},{"$f":"Veri2!E173","v":"Edgeworth Eagles"},{"$f":"IF(Veri2!F173=\"\",\"0-0\",Veri2!F173)","v":"1-0"}]
[null,null,null,null,null,null,null,null,null,null,null,null,null,null,null,null,null,null,null,null,null,null,null,null,null,null,null,null,null,null,null,null,null,{"$f":"Veri2!A140","v":"D"},{"$f":"Veri2!B140","v":"2019-05-18"},{"$f":"Veri2!C140","v":"Lambton Jaffas"},{"$f":"IF(Veri2!D140=\"\",\"0 - 0\",Veri2!D140)","v":"2 - 2"},{"$f":"Veri2!E140","v":"Charlestown City B"},{"$f":"IF(Veri2!F140=\"\",\"0-0\",Veri2!F140)","v":"0-0"},{"$f":"Veri2!A174","v":"D"},{"$f":"Veri2!B174","v":"2019-06-23"},{"$f":"Veri2!C174","v":"Newcastle Jets II"},{"$f":"IF(Veri2!D174=\"\",\"0 - 0\",Veri2!D174)","v":"1 - 2"},{"$f":"Veri2!E174","v":"Edgeworth Eagles"},{"$f":"IF(Veri2!F174=\"\",\"0-0\",Veri2!F174)","v":"1-1"}]
[null,null,null,null,null,null,null,null,null,null,null,null,null,null,null,null,null,null,null,null,null,null,null,null,null,null,null,null,null,null,null,null,null,{"$f":"Veri2!A141","v":"D"},{"$f":"Veri2!B141","v":"2018-08-11"},{"$f":"Veri2!C141","v":"Lambton Jaffas"},{"$f":"IF(Veri2!D141=\"\",\"0 - 0\",Veri2!D141)","v":"0 - 1"},{"$f":"Veri2!E141","v":"Maitland"},{"$f":"IF(Veri2!F141=\"\",\"0-0\",Veri2!F141)","v":"0-1"},{"$f":"Veri2!A175","v":"D"},{"$f":"Veri2!B175","v":"2019-06-16"},{"$f":"Veri2!C175","v":"Charlestown City B"},{"$f":"IF(Veri2!D175=\"\",\"0 - 0\",Veri2!D175)","v":"1 - 0"},{"$f":"Veri2!E175","v":"Edgeworth Eagles"},{"$f":"IF(Veri2!F175=\"\",\"0-0\",Veri2!F175)","v":"0-0"}]
[null,null,null,null,null,null,null,null,null,null,null,null,null,null,null,null,null,null,null,null,null,null,null,null,null,null,null,null,null,null,null,null,null,{"$f":"Veri2!A142","v":"D"},{"$f":"Veri2!B142","v":"2018-07-24"},{"$f":"Veri2!C142","v":"Lambton Jaffas"},{"$f":"IF(Veri2!D142=\"\",\"0 - 0\",Veri2!D142)","v":"3 - 0"},{"$f":"Veri2!E142","v":"Newcastle Jets U21"},{"$f":"IF(Veri2!F142=\"\",\"0-0\",Veri2!F142)","v":"1-0"},{"$f":"Veri2!A176","v":"D"},{"$f":"Veri2!B176","v":"2019-05-19"},{"$f":"Veri2!C176","v":"Weston Bears"},{"$f":"IF(Veri2!D176=\"\",\"0 - 0\",Veri2!D176)","v":"2 - 1"},{"$f":"Veri2!E176","v":"Edgeworth Eagles"},{"$f":"IF(Veri2!F176=\"\",\"0-0\",Veri2!F176)","v":"0-0"}]
[null,null,null,null,null,null,null,null,null,null,null,null,null,null,null,null,null,null,null,null,null,null,null,null,null,null,null,null,null,null,null,null,null,{"$f":"Veri2!A143","v":"D"},{"$f":"Veri2!B143","v":"2018-07-14"},{"$f":"Veri2!C143","v":"Lambton Jaffas"},{"$f":"IF(Veri2!D143=\"\",\"0 - 0\",Veri2!D143)","v":"3 - 0"},{"$f":"Veri2!E143","v":"Valentine Phoenix"},{"$f":"IF(Veri2!F143=\"\",\"0-0\",Veri2!F143)","v":"1-0"},{"$f":"Veri2!A177","v":"D"},{"$f":"Veri2!B177","v":"2018-08-19"},{"$f":"Veri2!C177","v":"Valentine Phoenix"},{"$f":"IF(Veri2!D177=\"\",\"0 - 0\",Veri2!D177)","v":"0 - 1"},{"$f":"Veri2!E177","v":"Edgeworth Eagles"},{"$f":"IF(Veri2!F177=\"\",\"0-0\",Veri2!F177)","v":"0-0"}]
[null,null,null,null,null,null,null,null,null,null,null,null,null,null,null,null,null,null,null,null,null,null,null,null,null,null,null,null,null,null,null,null,null,{"$f":"Veri2!A144","v":"D"},{"$f":"Veri2!B144","v":"2018-06-30"},{"$f":"Veri2!C144","v":"Lambton Jaffas"},{"$f":"IF(Veri2!D144=\"\",\"0 - 0\",Veri2!D144)","v":"2 - 1"},{"$f":"Veri2!E144","v":"Charlestown City B"},{"$f":"IF(Veri2!F144=\"\",\"0-0\",Veri2!F144)","v":"1-1"},{"$f":"Veri2!A178","v":"D"},{"$f":"Veri2!B178","v":"2018-08-05"},{"$f":"Veri2!C178","v":"Adamstown Rosebuds"},{"$f":"IF(Veri2!D178=\"\",\"0 - 0\",Veri2!D178)","v":"0 - 1"},{"$f":"Veri2!E178","v":"Edgeworth Eagles"},{"$f":"IF(Veri2!F178=\"\",\"0-0\",Veri2!F178)","v":"0-0"}]
[null,null,null,null,null,null,null,null,null,null,null,null,null,null,null,null,null,null,null,null,null,null,null,null,null,null,null,null,null,null,null,null,null,{"$f":"Veri2!A145","v":"D"},{"$f":"Veri2!B145","v":"2018-06-16"},{"$f":"Veri2!C145","v":"Lambton Jaffas"},{"$f":"IF(Veri2!D145=\"\",\"0 - 0\",Veri2!D145)","v":"1 - 1"},{"$f":"Veri2!E145","v":"Broadmeadow Magic"},{"$f":"IF(Veri2!F145=\"\",\"0-0\",Veri2!F145)","v":"0-1"},{"$f":"Veri2!A179","v":"D"},{"$f":"Veri2!B179","v":"2018-07-22"},{"$f":"Veri2!C179","v":"Charlestown City B"},{"$f":"IF(Veri2!D179=\"\",\"0 - 0\",Veri2!D179)","v":"0 - 2"},{"$f":"Veri2!E179","v":"Edgeworth Eagles"},{"$f":"IF(Veri2!F179=\"\",\"0-0\",Veri2!F179)","v":"0-1"}]
[null,null,null,null,null,null,null,null,null,null,null,null,null,null,null,null,null,null,null,null,null,null,null,null,null,null,null,null,null,null,null,null,null,null,"G","B","M","AG","YG",null,"G","B","M","AG","YG"]
[null,null,null,null,null,null,null,null,null,null,null,null,null,null,null,null,null,null,null,null,null,null,null,null,null,null,null,null,null,null,null,null,null,"İlk Yarı",{"$f":"Veri2!B147","v":14},{"$f":"Veri2!C147","v":11},{"$f":"Veri2!D147","v":"3"},{"$f":"Veri2!E147","v":32},{"$f":"Veri2!F147","v":"16"},"İlk Yarı",{"$f":"Veri2!B181","v":12},{"$f":"Veri2!C181","v":9},{"$f":"Veri2!D181","v":"9"},{"$f":"Veri2!E181","v":25},{"$f":"Veri2!F181","v":"17"}]
[null,null,null,null,null,null,null,null,null,null,null,null,null,null,null,null,null,null,null,null,null,null,null,null,null,null,null,null,null,null,null,null,null,"Maç Sonu",{"$f":"Veri2!B148","v":18},{"$f":"Veri2!C148","v":7},{"$f":"Veri2!D148","v":"5"},{"$f":"Veri2!E148","v":66},{"$f":"Veri2!F148","v":"32"},"Maç Sonu",{"$f":"Veri2!B182","v":19},{"$f":"Veri2!C182","v":0},{"$f":"Veri2!D182","v":"11"},{"$f":"Veri2!E182","v":55},{"$f":"Veri2!F182","v":"38"}]
[]
[null,null,null,null,null,null,null,null,null,null,null,null,null,null,null,null,null,null,null,null,null,null,null,null,null,null,null,null,null,null,null,null,null,null,{"$f":"AI47","v":"1 "},{"$f":"AJ47","v":" 1"},{"$f":"AK47","v":"1"},{"$f":"AL47","v":"0"},null,null,{"$f":"AO47","v":"1 "},{"$f":"AP47","v":" 0"},{"$f":"AQ47","v":"1"},"0"]
[null,null,null,null,null,null,null,null,null,null,null,null,null,null,null,null,null,null,null,null,null,null,null,null,null,null,null,null,null,null,null,null,null,null,{"$f":"AI48","v":"1 "}," 1","1","1",null,null,{"$f":"AO48","v":"2 "}," 4","0","3"]
[null,null,null,null,null,null,null,null,null,null,null,null,null,null,null,null,null,null,null,null,null,null,null,null,null,null,null,null,null,null,null,null,null,null,"2 "," 1","0","0",null,null,"6 "," 2","3","1"]
[null,null,null,null,null,null,null,null,null,null,null,null,null,null,null,null,null,null,null,null,null,null,null,null,null,null,null,null,null,null,null,null,null,null,"2 "," 1","1","0",null,null,"3 "," 1","1","0"]
[null,null,null,null,null,null,null,null,null,null,null,null,null,null,null,null,null,null,null,null,null,null,null,null,null,null,null,null,null,null,null,null,null,null,{"$f":"AI51","v":"5 "}," 1",{"$f":"AK51","v":"0"},"0",null,null,"0 ",{"$f":"AP51","v":" 1"},"0","0"]
[]
[]
[null,null,null,null,null,null,null,null,null,null,null,null,null,null,null,null,null,null,null,null,null,null,null,null,null,null,null,null,null,null,null,null,null,null,{"$f":"(AI36+AI37+AI38+AI39+AI40+AI41+AI42)/5","v":2.2000000000000002},{"$f":"(AJ36+AJ37+AJ38+AJ39+AJ40+AJ41+AJ42)/5","v":1},{"$f":"(AK36+AK37+AK38+AK39+AK40+AK41+AK42)/5","v":0.6},{"$f":"(AL36+AL37+AL38+AL39+AL40+AL41+AL42)/5","v":0.2},null,null,{"$f":"(AO36+AO37+AO38+AO39+AO40+AO41+AO42)/5","v":2.4},{"$f":"(AP36+AP37+AP38+AP39+AP40+AP41+AP42)/5","v":1.6},{"$f":"(AQ36+AQ37+AQ38+AQ39+AQ40+AQ41+AQ42)/5","v":1},0.8]
[]
[]
[]
[null,null,null,null,null,null,null,null,null,null,null,null,null,null,null,null,null,null,null,null,null,null,null,null,null,null,null,null,null,null,null,null,null,{"$f":"IF(AK2=\"\",\" \",SEARCH(\"-\",AK2))","v":3},{"$f":"IF(AK2=\"\",\"0\",LEFT(AK2,AH47-1))","v":"1 "},{"$f":"IF(AK2=\"\",\"0\",MID(AK2,AH47+1,4))","v":" 1"},{"$f":"IF(AM2=\"\",\"0\",LEFT(AM2,AM47-1))","v":"1"},{"$f":"IF(AM2=\"\",\"0\",MID(AM2,AM47+1,4))","v":"0"},{"$f":"IF(AM2=\"\",\" \",SEARCH(\"-\",AM2))","v":2},{"$f":"IF(AQ2=\"\",\"0\",SEARCH(\"-\",AQ2))","v":3},{"$f":"IF(AQ2=\"\",\"0\",LEFT(AQ2,AN47-1))","v":"1 "},{"$f":"IF(AQ2=\"\",\"0\",MID(AQ2,AN47+1,4))","v":" 0"},{"$f":"IF(AS2=\"\",\"0\",LEFT(AS2,AS47-1))","v":"1"},{"$f":"IF(AS2=\"\",\"0\",MID(AS2,AS47+1,4))","v":"0"},{"$f":"IF(AS2=\"\",\" \",SEARCH(\"-\",AS2))","v":2}]
[null,null,null,null,null,null,null,null,null,null,null,null,null,null,null,null,null,null,null,null,null,null,null,null,null,null,null,null,null,null,null,null,null,{"$f":"IF(AK3=\"\",\" \",SEARCH(\"-\",AK3))","v":3},{"$f":"IF(AK3=\"\",\"0\",LEFT(AK3,AH48-1))","v":"1 "},{"$f":"IF(AK3=\"\",\"0\",MID(AK3,AH48+1,4))","v":" 1"},{"$f":"IF(AM3=\"\",\"0\",LEFT(AM3,AM48-1))","v":"1"},{"$f":"IF(AM3=\"\",\"0\",MID(AM3,AM48+1,4))","v":"1"},{"$f":"IF(AM3=\"\",\" \",SEARCH(\"-\",AM3))","v":2},{"$f":"IF(AQ3=\"\",\"0\",SEARCH(\"-\",AQ3))","v":3},{"$f":"IF(AQ3=\"\",\"0\",LEFT(AQ3,AN48-1))","v":"2 "},{"$f":"IF(AQ3=\"\",\"0\",MID(AQ3,AN48+1,4))","v":" 4"},{"$f":"IF(AS3=\"\",\"0\",LEFT(AS3,AS48-1))","v":"0"},{"$f":"IF(AS3=\"\",\"0\",MID(AS3,AS48+1,4))","v":"3"},{"$f":"IF(AS3=\"\",\" \",SEARCH(\"-\",AS3))","v":2}]
[null,null,null,null,null,null,null,null,null,null,null,null,null,null,null,null,null,null,null,null,null,null,null,null,null,null,null,null,null,null,null,null,null,3,"2 "," 1","0","0",2,3,"6 "," 2","3","1",{"$f":"IF(AS4=\"\",\" \",SEARCH(\"-\",AS4))","v":2}]
[null,null,null,null,null,null,null,null,null,null,null,null,null,null,null,null,null,null,null,null,null,null,null,null,null,null,null,null,null,null,null,null,null,3,"2 "," 1","1","0",2,3,"3 "," 1","1","0",2]
[null,null,null,null,null,null,null,null,null,null,null,null,null,null,null,null,null,null,null,null,null,null,null,null,null,null,null,null,null,null,null,null,null,3,"5 "," 1",{"$f":"IF(AM6=\"\",\"0\",LEFT(AM6,AM51-1))","v":"0"},{"$f":"IF(AM6=\"\",\"0\",MID(AM6,AM51+1,4))","v":"0"},{"$f":"IF(AM6=\"\",\"0-0\",SEARCH(\"-\",AM6))","v":2},3,"0 "," 1","0","0",2]
[null,null,null,null,null,null,null,null,null,null,null,null,null,null,null,null,null,null,null,null,null,null,null,null,null,null,null,null,null,null,null,null,null,3,"4 "," 1","2","1",2,3,"1 "," 2","0","2",2]
[null,null,null,null,null,null,null,null,null,null,null,null,null,null,null,null,null,null,null,null,null,null,null,null,null,null,null,null,null,null,null,null,null,3,"2 "," 1","1","1",2,3,"2 "," 4","2","1",2]
[null,null,null,null,null,null,null,null,null,null,null,null,null,null,null,null,null,null,null,null,null,null,null,null,null,null,null,null,null,null,null,null,null,3,"1 "," 2","1","0",2,3,"2 "," 1","1","0",2]
[]
[]
[null,null,null,null,null,null,null,null,null,null,null,null,null,null,null,null,null,null,null,null,null,null,null,null,null,null,null,null,null,null,null,null,null,null,{"$f":"IF(AI43>=4,AI43/1.3,AI43)","v":2.2000000000000002},{"$f":"IF(AJ43>=4,AJ43/1.3,AJ43)","v":1},null,null,null,null,{"$f":"IF(AO43>=4,AO43/1.3,AO43)","v":2.4},{"$f":"IF(AP43>=4,AP43/1.3,AP43)","v":1.6}]

{"sheet":"NW","index":5,"n_rows":22,"n_cols":70,"rows_kept":22,"cut":false,"hidden":true,"merged":[[18,7,19,10],[18,12,19,15],[18,32,19,35],[18,37,19,40],[18,55,19,58],[18,60,19,63],[13,37,16,38],[13,39,16,40],[13,55,16,56],[13,57,16,58],[13,60,16,61],[13,62,16,63],[13,7,16,8],[13,9,16,10],[13,12,16,13],[13,14,16,15],[13,32,16,33],[13,34,16,35],[12,37,12,38],[12,39,12,40],[12,55,12,56],[12,57,12,58],[12,60,12,61],[12,62,12,63],[12,7,12,8],[12,9,12,10],[12,12,12,13],[12,14,12,15],[12,32,12,33],[12,34,12,35],[9,10,9,12],[9,35,9,37],[9,58,9,60],[11,7,11,10],[11,12,11,15],[11,32,11,35],[11,37,11,40],[11,55,11,58],[11,60,11,63],[7,10,7,12],[7,35,7,37],[7,58,7,60],[8,10,8,12],[8,35,8,37],[8,58,8,60],[6,10,6,12],[6,35,6,37],[6,58,6,60],[1,49,1,52],[1,55,2,64],[3,55,3,64],[5,10,5,12],[5,35,5,37],[5,58,5,60],[1,66,1,69],[3,3,3,4],[3,7,3,16],[3,20,3,21],[3,26,3,27],[3,32,3,41],[3,45,3,46],[3,51,3,52],[1,1,1,4],[1,7,2,16],[1,18,1,21],[1,24,1,27],[1,32,2,41],[1,43,1,46],[3,68,3,69]]}
[]
[null,{"$f":"H13","v":"[4]   Lambton Jarvis"},null,null,null,null,null,"GENEL ANALİZ - SONUÇLARI",null,null,null,null,null,null,null,null,null,null,{"$f":"O13","v":"[5]   Edgeworth Eagles FC"},null,null,null,null,null,{"$f":"B2","v":"[4]   Lambton Jarvis"},null,null,null,null,null,null,null,"İÇ-DIŞ ANALİZ - SONUÇLARI",null,null,null,null,null,null,null,null,null,null,{"$f":"S2","v":"[5]   Edgeworth Eagles FC"},null,null,null,null,null,{"$f":"BD13","v":"[4]   Lambton Jarvis"},null,null,null,null,null,"FORM SON 6 - SONUÇLARI",null,null,null,null,null,null,null,null,null,null,{"$f":"BK13","v":"[5]   Edgeworth Eagles FC"}]
[]
[null,{"$f":"Veri3!B3","v":"[4]   Lambton Jarvis"},{"$f":"Veri3!B14","v":"[5]   Edgeworth Eagles FC"},"Ortalama",null,null,null,"PLAYER",null,null,null,null,null,null,null,null,null,null,{"$f":"$B$4","v":"[4]   Lambton Jarvis"},{"$f":"$C$4","v":"[5]   Edgeworth Eagles FC"},"Ortalama",null,null,null,{"$f":"Veri3!$B$3","v":"[4]   Lambton Jarvis"},{"$f":"Veri3!$B$14","v":"[5]   Edgeworth Eagles FC"},"Ortalama",null,null,null,null,null,"PLAYER",null,null,null,null,null,null,null,null,null,null,{"$f":"$B$4","v":"[4]   Lambton Jarvis"},{"$f":"$C$4","v":"[5]   Edgeworth Eagles FC"},"Ortalama",null,null,null,{"$f":"$B$4","v":"[4]   Lambton Jarvis"},{"$f":"$C$4","v":"[5]   Edgeworth Eagles FC"},"Ortalama",null,null,null,"PLAYER",null,null,null,null,null,null,null,null,null,null,{"$f":"$B$4","v":"[4]   Lambton Jarvis"},{"$f":"$C$4","v":"[5]   Edgeworth Eagles FC"},"Ortalama"]
[null,{"$f":"Veri3!W4","v":0.7142857142857143},{"$f":"Veri3!W10","v":0.88888888888888884},"gPS","Number of Positions Entered",null,null,null,null,null,null,null,null,null,null,null,null,null,{"$f":"Veri3!W17","v":1.4285714285714286},{"$f":"Veri3!W23","v":1.5555555555555556},"gPS","Number of Positions Entered",null,null,{"$f":"Veri3!W5","v":0.66666666666666663},{"$f":"Veri3!W12","v":0.8},"gPS","Number of Positions Entered",null,null,null,null,null,null,null,null,null,null,null,null,null,null,null,{"$f":"Veri3!W18","v":1.3333333333333333},{"$f":"Veri3!W25","v":1.6},"gPS","Number of Positions Entered",null,null,{"$f":"Veri3!W7","v":0.83333333333333337},{"$f":"Veri3!W13","v":1.3333333333333333},"gPS","Number of Positions Entered",null,null,null,null,null,null,null,null,null,null,null,null,null,{"$f":"Veri3!W20","v":1.3333333333333333},{"$f":"Veri3!W26","v":2},"gPS","Number of Positions Entered"]
[null,{"$f":"Veri3!X4","v":0.42857142857142855},{"$f":"Veri3!X10","v":0.66666666666666663},"vPS","Number of Positions Given",null,null,null,null,null,"UNDER / OVER",null,null,null,null,null,null,null,{"$f":"Veri3!X17","v":1},{"$f":"Veri3!X23","v":1.7777777777777777},"vPS","Number of Positions Given",null,null,{"$f":"Veri3!X5","v":0.33333333333333331},{"$f":"Veri3!X12","v":1},"vPS","Number of Positions Given",null,null,null,null,null,null,null,"UNDER / OVER",null,null,null,null,null,null,null,{"$f":"Veri3!X18","v":1},{"$f":"Veri3!X25","v":2.4},"vPS","Number of Positions Given",null,null,{"$f":"Veri3!X7","v":0.5},{"$f":"Veri3!X13","v":0.83333333333333337},"vPS","Number of Positions Given",null,null,null,null,null,"UNDER / OVER",null,null,null,null,null,null,null,{"$f":"Veri3!X20","v":1},{"$f":"Veri3!X26","v":1.8333333333333333},"vPS","Number of Positions Given"]
[null,{"$f":"(B5+1)/(B6+1)","v":1.2},{"$f":"(C5+1)/(C6+1)","v":1.1333333333333333},"pBAS","Number Per Position",null,null,null,null,null,"BTTS / KARŞILIKLI GOL",null,null,null,null,null,null,null,{"$f":"(S5+1)/(S6+1)","v":1.2142857142857144},{"$f":"(T5+1)/(T6+1)","v":0.91999999999999993},"pBAS","Number Per Position",null,null,{"$f":"(Y5+1)/(Y6+1)","v":1.25},{"$f":"(Z5+1)/(Z6+1)","v":0.9},"pBAS","Number Per Position",null,null,null,null,null,null,null,"BTTS / KARŞILIKLI GOL",null,null,null,null,null,null,null,{"$f":"(AR5+1)/(AR6+1)","v":1.1666666666666665},{"$f":"(AS5+1)/(AS6+1)","v":0.76470588235294124},"pBAS","Number Per Position",null,null,{"$f":"(AX5+1)/(AX6+1)","v":1.2222222222222223},{"$f":"(AY5+1)/(AY6+1)","v":1.2727272727272725},"pBAS","Number Per Position",null,null,null,null,null,"BTTS / KARŞILIKLI GOL",null,null,null,null,null,null,null,{"$f":"(BO5+1)/(BO6+1)","v":1.1666666666666665},{"$f":"(BP5+1)/(BP6+1)","v":1.0588235294117647},"pBAS","Number Per Position"]
[null,{"$f":"(B6+1)/(B5+1)","v":0.83333333333333326},{"$f":"(C6+1)/(C5+1)","v":0.88235294117647056},"pBYS","Number Eats Per Position",null,null,null,null,null,{"$f":"IF(AND(S22>=1,T22>=1),\"VAR\",\"YOK\")","v":"VAR"},null,null,null,null,null,null,null,{"$f":"(S6+1)/(S5+1)","v":0.82352941176470584},{"$f":"(T6+1)/(T5+1)","v":1.0869565217391304},"pBYS","Number Eats Per Position",null,null,{"$f":"(Y6+1)/(Y5+1)","v":0.8},{"$f":"(Z6+1)/(Z5+1)","v":1.1111111111111112},"pBYS","Number Eats Per Position",null,null,null,null,null,null,null,{"$f":"IF(AND(AR22>=1,AS22>=1),\"VAR\",\"YOK\")","v":"VAR"},null,null,null,null,null,null,null,{"$f":"(AR6+1)/(AR5+1)","v":0.85714285714285721},{"$f":"(AS6+1)/(AS5+1)","v":1.3076923076923077},"pBYS","Number Eats Per Position",null,null,{"$f":"(AX6+1)/(AX5+1)","v":0.81818181818181812},{"$f":"(AY6+1)/(AY5+1)","v":0.78571428571428592},"pBYS","Number Eats Per Position",null,null,null,null,null,{"$f":"IF(AND(BO22>=1,BP22>=1),\"VAR\",\"YOK\")","v":"VAR"},null,null,null,null,null,null,null,{"$f":"(BO6+1)/(BO5+1)","v":0.85714285714285721},{"$f":"(BP6+1)/(BP5+1)","v":0.94444444444444431},"pBYS","Number Eats Per Position"]
[null,null,null,null,null,null,null,null,null,null,"HT/FT",null,null,null,null,null,null,null,null,null,null,null,null,null,null,null,null,null,null,null,null,null,null,null,null,"HT/FT",null,null,null,null,null,null,null,null,null,null,null,null,null,null,null,null,null,null,null,null,null,null,"HT/FT"]
[null,"Max A","Max B","Min A","Min B",null,null,{"$f":"H14&\" - \"&J14","v":"1 - 1"},null,null,{"$f":"IF(AND((H14>J14),(M14>O14)),\"1 / 1\",IF(AND((H14=J14),(M14>O14)),\"X / 1\",IF(AND((H14<J14),(M14>O14)),\"2 / 1\",IF(AND((H14>J14),(M14=O14)),\"1 / X\",IF(AND((H14=J14),(M14=O14)),\"X / X\",IF(AND((H14<J14),(M14=O14)),\"2 / X\",IF(AND((H14>J14),(M14<O14)),\"1 / 2\",IF(AND((H14=J14),(M14<O14)),\"X / 2\",IF(AND((H14<J14),(M14<O14)),\"2 / 2\")))))))))","v":"X / 1"},null,null,null,null,{"$f":"M14&\" - \"&O14","v":"2 - 1"},null,null,"Max A","Max B","Min A","Min B",null,null,"Max A","Max B","Min A","Min B",null,null,null,null,{"$f":"AG14&\" - \"&AI14","v":"1 - 0"},null,null,{"$f":"IF(AND((AG14>AI14),(AL14>AN14)),\"1 / 1\",IF(AND((AG14=AI14),(AL14>AN14)),\"X / 1\",IF(AND((AG14<AI14),(AL14>AN14)),\"2 / 1\",IF(AND((AG14>AI14),(AL14=AN14)),\"1 / X\",IF(AND((AG14=AI14),(AL14=AN14)),\"X / X\",IF(AND((AG14<AI14),(AL14=AN14)),\"2 / X\",IF(AND((AG14>AI14),(AL14<AN14)),\"1 / 2\",IF(AND((AG14=AI14),(AL14<AN14)),\"X / 2\",IF(AND((AG14<AI14),(AL14<AN14)),\"2 / 2\")))))))))","v":"1 / 1"},null,null,null,null,{"$f":"AL14&\" - \"&AN14","v":"2 - 1"},null,null,"Max A","Max B","Min A","Min B",null,null,"Max A","Max B","Min A","Min B",null,null,{"$f":"BD14&\" - \"&BF14","v":"1 - 1"},null,null,{"$f":"IF(AND((BD14>BF14),(BI14>BK14)),\"1 / 1\",IF(AND((BD14=BF14),(BI14>BK14)),\"X / 1\",IF(AND((BD14<BF14),(BI14>BK14)),\"2 / 1\",IF(AND((BD14>BF14),(BI14=BK14)),\"1 / X\",IF(AND((BD14=BF14),(BI14=BK14)),\"X / X\",IF(AND((BD14<BF14),(BI14=BK14)),\"2 / X\",IF(AND((BD14>BF14),(BI14<BK14)),\"1 / 2\",IF(AND((BD14=BF14),(BI14<BK14)),\"X / 2\",IF(AND((BD14<BF14),(BI14<BK14)),\"2 / 2\")))))))))","v":"X / 1"},null,null,null,null,{"$f":"BI14&\" - \"&BK14","v":"2 - 1"},null,null,"Max A","Max B","Min A","Min B"]
[null,{"$f":"MAX(C6,B5)","v":0.7142857142857143},{"$f":"MAX(C5,B6)","v":0.88888888888888884},{"$f":"MIN(C6,B5)","v":0.66666666666666663},{"$f":"MIN(C5,B6)","v":0.42857142857142855},null,null,null,null,null,null,null,null,null,null,null,null,null,{"$f":"MAX(T6,S5)","v":1.7777777777777777},{"$f":"MAX(T5,S6)","v":1.5555555555555556},{"$f":"MIN(T6,S5)","v":1.4285714285714286},{"$f":"MIN(T5,S6)","v":1},null,null,{"$f":"MAX(Z6,Y5)","v":1},{"$f":"MAX(Z5,Y6)","v":0.8},{"$f":"MIN(Z6,Y5)","v":0.66666666666666663},{"$f":"MIN(Z5,Y6)","v":0.33333333333333331},null,null,null,null,null,null,null,null,null,null,null,null,null,null,null,{"$f":"MAX(AS6,AR5)","v":2.4},{"$f":"MAX(AS5,AR6)","v":1.6},{"$f":"MIN(AS6,AR5)","v":1.3333333333333333},{"$f":"MIN(AS5,AR6)","v":1},null,null,{"$f":"MAX(AY6,AX5)","v":0.83333333333333337},{"$f":"MAX(AY5,AX6)","v":1.3333333333333333},{"$f":"MIN(AY6,AX5)","v":0.83333333333333337},{"$f":"MIN(AY5,AX6)","v":0.5},null,null,null,null,null,null,null,null,null,null,null,null,null,{"$f":"MAX(BP6,BO5)","v":1.8333333333333333},{"$f":"MAX(BP5,BO6)","v":2},{"$f":"MIN(BP6,BO5)","v":1.3333333333333333},{"$f":"MIN(BP5,BO6)","v":1}]
[null,{"$f":"MAX(B7,C8)","v":1.2},{"$f":"MAX(C7,B8)","v":1.1333333333333333},{"$f":"MIN(B7,C8)","v":0.88235294117647056},{"$f":"MIN(C7,B8)","v":0.83333333333333326},null,null,"HT / İLK YARI",null,null,null,null,"FT / MAÇ SONU",null,null,null,null,null,{"$f":"MAX(S7,T8)","v":1.2142857142857144},{"$f":"MAX(T7,S8)","v":0.91999999999999993},{"$f":"MIN(S7,T8)","v":1.0869565217391304},{"$f":"MIN(T7,S8)","v":0.82352941176470584},null,null,{"$f":"MAX(Y7,Z8)","v":1.25},{"$f":"MAX(Z7,Y8)","v":0.9},{"$f":"MIN(Y7,Z8)","v":1.1111111111111112},{"$f":"MIN(Z7,Y8)","v":0.8},null,null,null,null,"HT / İLK YARI",null,null,null,null,"FT / MAÇ SONU",null,null,null,null,null,{"$f":"MAX(AR7,AS8)","v":1.3076923076923077},{"$f":"MAX(AS7,AR8)","v":0.85714285714285721},{"$f":"MIN(AR7,AS8)","v":1.1666666666666665},{"$f":"MIN(AS7,AR8)","v":0.76470588235294124},null,null,{"$f":"MAX(AX7,AY8)","v":1.2222222222222223},{"$f":"MAX(AY7,AX8)","v":1.2727272727272725},{"$f":"MIN(AX7,AY8)","v":0.78571428571428592},{"$f":"MIN(AY7,AX8)","v":0.81818181818181812},null,null,"HT / İLK YARI",null,null,null,null,"FT / MAÇ SONU",null,null,null,null,null,{"$f":"MAX(BO7,BP8)","v":1.1666666666666665},{"$f":"MAX(BP7,BO8)","v":1.0588235294117647},{"$f":"MIN(BO7,BP8)","v":0.94444444444444431},{"$f":"MIN(BP7,BO8)","v":0.85714285714285721}]
[null,{"$f":"B11*B12","v":0.8571428571428571},{"$f":"C11*C12","v":1.0074074074074073},{"$f":"D11*D12","v":0.58823529411764697},{"$f":"E11*E12","v":0.3571428571428571},null,null,{"$f":"B4","v":"[4]   Lambton Jarvis"},null,{"$f":"C4","v":"[5]   Edgeworth Eagles FC"},null,null,{"$f":"H13","v":"[4]   Lambton Jarvis"},null,{"$f":"J13","v":"[5]   Edgeworth Eagles FC"},null,null,null,{"$f":"S11*S12","v":2.1587301587301591},{"$f":"T11*T12","v":1.431111111111111},{"$f":"U11*U12","v":1.5527950310559007},{"$f":"V11*V12","v":0.82352941176470584},null,null,{"$f":"Y11*Y12","v":1.25},{"$f":"Z11*Z12","v":0.72000000000000008},{"$f":"AA11*AA12","v":0.7407407407407407},{"$f":"AB11*AB12","v":0.26666666666666666},null,null,null,null,{"$f":"Y4","v":"[4]   Lambton Jarvis"},null,{"$f":"Z4","v":"[5]   Edgeworth Eagles FC"},null,null,{"$f":"AG13","v":"[4]   Lambton Jarvis"},null,{"$f":"AI13","v":"[5]   Edgeworth Eagles FC"},null,null,null,{"$f":"AR11*AR12","v":3.1384615384615384},{"$f":"AS11*AS12","v":1.3714285714285717},{"$f":"AT11*AT12","v":1.5555555555555554},{"$f":"AU11*AU12","v":0.76470588235294124},null,null,{"$f":"AX11*AX12","v":1.0185185185185186},{"$f":"AY11*AY12","v":1.6969696969696966},{"$f":"AZ11*AZ12","v":0.65476190476190499},{"$f":"BA11*BA12","v":0.40909090909090906},null,null,{"$f":"AX4","v":"[4]   Lambton Jarvis"},null,{"$f":"AY4","v":"[5]   Edgeworth Eagles FC"},null,null,{"$f":"BD13","v":"[4]   Lambton Jarvis"},null,{"$f":"BF13","v":"[5]   Edgeworth Eagles FC"},null,null,null,{"$f":"BO11*BO12","v":2.1388888888888884},{"$f":"BP11*BP12","v":2.1176470588235294},{"$f":"BQ11*BQ12","v":1.2592592592592591},{"$f":"BR11*BR12","v":0.85714285714285721}]
[null,{"$f":"B13","v":0.8571428571428571},{"$f":"C13","v":1.0074074074074073},{"$f":"D13","v":0.58823529411764697},{"$f":"E13","v":0.3571428571428571},null,null,{"$f":"B22","v":1},null,{"$f":"C22","v":1},null,null,{"$f":"S22","v":2},null,{"$f":"T22","v":1},null,null,null,{"$f":"S13","v":2.1587301587301591},{"$f":"T13","v":1.431111111111111},{"$f":"U13","v":1.5527950310559007},{"$f":"V13","v":0.82352941176470584},null,null,{"$f":"Y13","v":1.25},{"$f":"Z13","v":0.72000000000000008},{"$f":"AA13","v":0.7407407407407407},{"$f":"AB13","v":0.26666666666666666},null,null,null,null,{"$f":"Y22","v":1},null,{"$f":"Z22","v":0},null,null,{"$f":"AR22","v":2},null,{"$f":"AS22","v":1},null,null,null,{"$f":"AR13","v":3.1384615384615384},{"$f":"AS13","v":1.3714285714285717},{"$f":"AT13","v":1.5555555555555554},{"$f":"AU13","v":0.76470588235294124},null,null,{"$f":"AX13","v":1.0185185185185186},{"$f":"AY13","v":1.6969696969696966},{"$f":"AZ13","v":0.65476190476190499},{"$f":"BA13","v":0.40909090909090906},null,null,{"$f":"AX22","v":1},null,{"$f":"AY22","v":1},null,null,{"$f":"BO22","v":2},null,{"$f":"BP22","v":1},null,null,null,{"$f":"BO13","v":2.1388888888888884},{"$f":"BP13","v":2.1176470588235294},{"$f":"BQ13","v":1.2592592592592591},{"$f":"BR13","v":0.85714285714285721}]
[null,{"$f":"H13","v":"[4]   Lambton Jarvis"},{"$f":"AVERAGE(B14,D14)","v":0.72268907563025198},{"$f":"J13","v":"[5]   Edgeworth Eagles FC"},{"$f":"AVERAGE(C14,E14)","v":0.68227513227513215},null,null,null,null,null,null,null,null,null,null,null,null,null,{"$f":"M13","v":"[4]   Lambton Jarvis"},{"$f":"AVERAGE(S14,U14)","v":1.8557625948930299},{"$f":"O13","v":"[5]   Edgeworth Eagles FC"},{"$f":"AVERAGE(T14,V14)","v":1.1273202614379083},null,null,{"$f":"AG13","v":"[4]   Lambton Jarvis"},{"$f":"AVERAGE(Y14,AA14)","v":0.99537037037037035},{"$f":"AI13","v":"[5]   Edgeworth Eagles FC"},{"$f":"AVERAGE(Z14,AB14)","v":0.4933333333333334},null,null,null,null,null,null,null,null,null,null,null,null,null,null,null,{"$f":"AL13","v":"[4]   Lambton Jarvis"},{"$f":"AVERAGE(AR14,AT14)","v":2.3470085470085467},{"$f":"AN13","v":"[5]   Edgeworth Eagles FC"},{"$f":"AVERAGE(AS14,AU14)","v":1.0680672268907565},null,null,{"$f":"BD13","v":"[4]   Lambton Jarvis"},{"$f":"AVERAGE(AX14,AZ14)","v":0.83664021164021185},{"$f":"BF13","v":"[5]   Edgeworth Eagles FC"},{"$f":"AVERAGE(AY14,BA14)","v":1.0530303030303028},null,null,null,null,null,null,null,null,null,null,null,null,null,{"$f":"BI13","v":"[4]   Lambton Jarvis"},{"$f":"AVERAGE(BO14,BQ14)","v":1.6990740740740737},{"$f":"BK13","v":"[5]   Edgeworth Eagles FC"},{"$f":"AVERAGE(BP14,BR14)","v":1.4873949579831933}]
[]
[null,"A_ort","B_ort","Mean A","Mean B",null,null,null,null,null,null,null,null,null,null,null,null,null,"A_ort","B_ort","Mean A","Mean B",null,null,"A_ort","B_ort","Mean A","Mean B",null,null,null,null,null,null,null,null,null,null,null,null,null,null,null,"A_ort","B_ort","Mean A","Mean B",null,null,"A_ort","B_ort","Mean A","Mean B",null,null,null,null,null,null,null,null,null,null,null,null,null,"A_ort","B_ort","Mean A","Mean B"]
[null,{"$f":"B5*B7","v":0.8571428571428571},{"$f":"C5*C7","v":1.0074074074074073},{"$f":"B7+0.02","v":1.22},{"$f":"C7+0.02","v":1.1533333333333333},null,null,null,null,null,null,null,null,null,null,null,null,null,{"$f":"S5*S7","v":1.7346938775510206},{"$f":"T5*T7","v":1.431111111111111},{"$f":"S7+0.02","v":1.2342857142857144},{"$f":"T7+0.02","v":0.94},null,null,{"$f":"Y5*Y7","v":0.83333333333333326},{"$f":"Z5*Z7","v":0.72000000000000008},{"$f":"Y7+0.02","v":1.27},{"$f":"Z7+0.02","v":0.92},null,null,null,null,null,null,null,null,null,null,null,null,null,null,null,{"$f":"AR5*AR7","v":1.5555555555555554},{"$f":"AS5*AS7","v":1.223529411764706},{"$f":"AR7+0.02","v":1.1866666666666665},{"$f":"AS7+0.02","v":0.78470588235294125},null,null,{"$f":"AX5*AX7","v":1.0185185185185186},{"$f":"AY5*AY7","v":1.6969696969696966},{"$f":"AX7+0.02","v":1.2422222222222223},{"$f":"AY7+0.02","v":1.2927272727272725},null,null,null,null,null,null,null,null,null,null,null,null,null,{"$f":"BO5*BO7","v":1.5555555555555554},{"$f":"BP5*BP7","v":2.1176470588235294},{"$f":"BO7+0.02","v":1.1866666666666665},{"$f":"BP7+0.02","v":1.0788235294117647}]
[null,{"$f":"B5*C8","v":0.63025210084033612},{"$f":"C5*B8","v":0.74074074074074059},{"$f":"B7-0.02","v":1.18},{"$f":"C7-0.02","v":1.1133333333333333},null,null,{"$f":"IF(AND(SUM(B22,C22)>0,SUM(B22,C22)<2),\"0.5 GOL ÜST\",IF(AND(SUM(B22,C22)>=2,SUM(B22,C22)<3),\"1.5 GOL ÜST\",IF(AND(SUM(B22,C22)>=3,SUM(B22,C22)<4),\"2.5 GOL ÜST\",IF(AND(SUM(B22,C22)>=4,SUM(B22,C22)<5),\"3.5 GOL ÜST\",IF(AND(SUM(B22,C22)>=5,SUM(B22,C22)<6),\"4.5 GOL ÜST\",IF(AND(SUM(B22,C22)>=6,SUM(B22,C22)<7),\"5.5 GOL ÜST\",IF(AND(SUM(B22,C22)>=7,SUM(B22,C22)<8),\"6.5 GOL ÜST\",IF(SUM(B22,C22)>=8,\"7+\",\"BAHİS OYNAMA\"))))))))","v":"1.5 GOL ÜST"},null,null,null,null,{"$f":"IF(AND(SUM(S22,T22)>0,SUM(S22,T22)<2),\"0.5 GOL ÜST\",IF(AND(SUM(S22,T22)>=2,SUM(S22,T22)<3),\"1.5 GOL ÜST\",IF(AND(SUM(S22,T22)>=3,SUM(S22,T22)<4),\"2.5 GOL ÜST\",IF(AND(SUM(S22,T22)>=4,SUM(S22,T22)<5),\"3.5 GOL ÜST\",IF(AND(SUM(S22,T22)>=5,SUM(S22,T22)<6),\"4.5 GOL ÜST\",IF(AND(SUM(S22,T22)>=6,SUM(S22,T22)<7),\"5.5 GOL ÜST\",IF(AND(SUM(S22,T22)>=7,SUM(S22,T22)<8),\"6.5 GOL ÜST\",IF(SUM(S22,T22)>=8,\"7+\",\"BAHİS OYNAMA\"))))))))","v":"2.5 GOL ÜST"},null,null,null,null,null,{"$f":"S5*T8","v":1.5527950310559007},{"$f":"T5*S8","v":1.2810457516339868},{"$f":"S7-0.02","v":1.1942857142857144},{"$f":"T7-0.02","v":0.89999999999999991},null,null,{"$f":"Y5*Z8","v":0.7407407407407407},{"$f":"Z5*Y8","v":0.64000000000000012},{"$f":"Y7-0.02","v":1.23},{"$f":"Z7-0.02","v":0.88},null,null,null,null,{"$f":"IF(AND(SUM(AA22,AB22)>0,SUM(AA22,AB22)<2),\"0.5 GOL ÜST\",IF(AND(SUM(AA22,AB22)>=2,SUM(AA22,AB22)<3),\"1.5 GOL ÜST\",IF(AND(SUM(AA22,AB22)>=3,SUM(AA22,AB22)<4),\"2.5 GOL ÜST\",IF(AND(SUM(AA22,AB22)>=4,SUM(AA22,AB22)<5),\"3.5 GOL ÜST\",IF(AND(SUM(AA22,AB22)>=5,SUM(AA22,AB22)<6),\"4.5 GOL ÜST\",IF(AND(SUM(AA22,AB22)>=6,SUM(AA22,AB22)<7),\"5.5 GOL ÜST\",IF(AND(SUM(AA22,AB22)>=7,SUM(AA22,AB22)<8),\"6.5 GOL ÜST\",IF(SUM(AA22,AB22)>=8,\"7+\",\"BAHİS OYNAMA\"))))))))","v":"1.5 GOL ÜST"},null,null,null,null,{"$f":"IF(AND(SUM(AR22,AS22)>0,SUM(AR22,AS22)<2),\"0.5 GOL ÜST\",IF(AND(SUM(AR22,AS22)>=2,SUM(AR22,AS22)<3),\"1.5 GOL ÜST\",IF(AND(SUM(AR22,AS22)>=3,SUM(AR22,AS22)<4),\"2.5 GOL ÜST\",IF(AND(SUM(AR22,AS22)>=4,SUM(AR22,AS22)<5),\"3.5 GOL ÜST\",IF(AND(SUM(AR22,AS22)>=5,SUM(AR22,AS22)<6),\"4.5 GOL ÜST\",IF(AND(SUM(AR22,AS22)>=6,SUM(AR22,AS22)<7),\"5.5 GOL ÜST\",IF(AND(SUM(AR22,AS22)>=7,SUM(AR22,AS22)<8),\"6.5 GOL ÜST\",IF(SUM(AR22,AS22)>=8,\"7+\",\"BAHİS OYNAMA\"))))))))","v":"2.5 GOL ÜST"},null,null,null,null,null,{"$f":"AR5*AS8","v":1.7435897435897436},{"$f":"AS5*AR8","v":1.3714285714285717},{"$f":"AR7-0.02","v":1.1466666666666665},{"$f":"AS7-0.02","v":0.74470588235294122},null,null,{"$f":"AX5*AY8","v":0.65476190476190499},{"$f":"AY5*AX8","v":1.0909090909090908},{"$f":"AX7-0.02","v":1.2022222222222223},{"$f":"AY7-0.02","v":1.2527272727272725},null,null,{"$f":"IF(AND(SUM(AX22,AY22)>0,SUM(AX22,AY22)<2),\"0.5 GOL ÜST\",IF(AND(SUM(AX22,AY22)>=2,SUM(AX22,AY22)<3),\"1.5 GOL ÜST\",IF(AND(SUM(AX22,AY22)>=3,SUM(AX22,AY22)<4),\"2.5 GOL ÜST\",IF(AND(SUM(AX22,AY22)>=4,SUM(AX22,AY22)<5),\"3.5 GOL ÜST\",IF(AND(SUM(AX22,AY22)>=5,SUM(AX22,AY22)<6),\"4.5 GOL ÜST\",IF(AND(SUM(AX22,AY22)>=6,SUM(AX22,AY22)<7),\"5.5 GOL ÜST\",IF(AND(SUM(AX22,AY22)>=7,SUM(AX22,AY22)<8),\"6.5 GOL ÜST\",IF(SUM(AX22,AY22)>=8,\"7+\",\"BAHİS OYNAMA\"))))))))","v":"1.5 GOL ÜST"},null,null,null,null,{"$f":"IF(AND(SUM(BO22,BP22)>0,SUM(BO22,BP22)<2),\"0.5 GOL ÜST\",IF(AND(SUM(BO22,BP22)>=2,SUM(BO22,BP22)<3),\"1.5 GOL ÜST\",IF(AND(SUM(BO22,BP22)>=3,SUM(BO22,BP22)<4),\"2.5 GOL ÜST\",IF(AND(SUM(BO22,BP22)>=4,SUM(BO22,BP22)<5),\"3.5 GOL ÜST\",IF(AND(SUM(BO22,BP22)>=5,SUM(BO22,BP22)<6),\"4.5 GOL ÜST\",IF(AND(SUM(BO22,BP22)>=6,SUM(BO22,BP22)<7),\"5.5 GOL ÜST\",IF(AND(SUM(BO22,BP22)>=7,SUM(BO22,BP22)<8),\"6.5 GOL ÜST\",IF(SUM(BO22,BP22)>=8,\"7+\",\"BAHİS OYNAMA\"))))))))","v":"2.5 GOL ÜST"},null,null,null,null,null,{"$f":"BO5*BP8","v":1.2592592592592591},{"$f":"BP5*BO8","v":1.7142857142857144},{"$f":"BO7-0.02","v":1.1466666666666665},{"$f":"BP7-0.02","v":1.0388235294117647}]
[null,{"$f":"C6*B7","v":0.79999999999999993},{"$f":"B6*C7","v":0.48571428571428565},{"$f":"B8+0.02","v":0.85333333333333328},{"$f":"C8+0.02","v":0.90235294117647058},null,null,null,null,null,null,null,null,null,null,null,null,null,{"$f":"T6*S7","v":2.1587301587301591},{"$f":"S6*T7","v":0.91999999999999993},{"$f":"S8+0.02","v":0.84352941176470586},{"$f":"T8+0.02","v":1.1069565217391304},null,null,{"$f":"Z6*Y7","v":1.25},{"$f":"Y6*Z7","v":0.3},{"$f":"Y8+0.02","v":0.82000000000000006},{"$f":"Z8+0.02","v":1.1311111111111112},null,null,null,null,null,null,null,null,null,null,null,null,null,null,null,{"$f":"AS6*AR7","v":2.7999999999999994},{"$f":"AR6*AS7","v":0.76470588235294124},{"$f":"AR8+0.02","v":0.87714285714285722},{"$f":"AS8+0.02","v":1.3276923076923077},null,null,{"$f":"AY6*AX7","v":1.0185185185185186},{"$f":"AX6*AY7","v":0.63636363636363624},{"$f":"AX8+0.02","v":0.83818181818181814},{"$f":"AY8+0.02","v":0.80571428571428594},null,null,null,null,null,null,null,null,null,null,null,null,null,{"$f":"BP6*BO7","v":2.1388888888888884},{"$f":"BO6*BP7","v":1.0588235294117647},{"$f":"BO8+0.02","v":0.87714285714285722},{"$f":"BP8+0.02","v":0.96444444444444433}]
[null,{"$f":"C6*C8","v":0.58823529411764697},{"$f":"B6*B8","v":0.3571428571428571},{"$f":"B8-0.02","v":0.81333333333333324},{"$f":"C8-0.02","v":0.86235294117647054},null,null,null,null,null,null,null,null,null,null,null,null,null,{"$f":"T6*T8","v":1.9323671497584538},{"$f":"S6*S8","v":0.82352941176470584},{"$f":"S8-0.02","v":0.80352941176470583},{"$f":"T8-0.02","v":1.0669565217391304},null,null,{"$f":"Z6*Z8","v":1.1111111111111112},{"$f":"Y6*Y8","v":0.26666666666666666},{"$f":"Y8-0.02","v":0.78},{"$f":"Z8-0.02","v":1.0911111111111111},null,null,null,null,null,null,null,null,null,null,null,null,null,null,null,{"$f":"AS6*AS8","v":3.1384615384615384},{"$f":"AR6*AR8","v":0.85714285714285721},{"$f":"AR8-0.02","v":0.83714285714285719},{"$f":"AS8-0.02","v":1.2876923076923077},null,null,{"$f":"AY6*AY8","v":0.65476190476190499},{"$f":"AX6*AX8","v":0.40909090909090906},{"$f":"AX8-0.02","v":0.7981818181818181},{"$f":"AY8-0.02","v":0.7657142857142859},null,null,null,null,null,null,null,null,null,null,null,null,null,{"$f":"BP6*BP8","v":1.7314814814814812},{"$f":"BO6*BO8","v":0.85714285714285721},{"$f":"BO8-0.02","v":0.83714285714285719},{"$f":"BP8-0.02","v":0.92444444444444429}]
[null,{"$f":"ROUND(AVERAGE(B18:B21),0)","v":1},{"$f":"ROUND(AVERAGE(C18:C21),0)","v":1},{"$f":"ROUND(AVERAGE(D18:D21),0)","v":1},{"$f":"ROUND(AVERAGE(E18:E21),0)","v":1},null,null,null,null,null,null,null,null,null,null,null,null,null,{"$f":"ROUND(AVERAGE(S18:S21),0)","v":2},{"$f":"ROUND(AVERAGE(T18:T21),0)","v":1},{"$f":"ROUND(AVERAGE(U18:U21),0)","v":1},{"$f":"ROUND(AVERAGE(V18:V21),0)","v":1},null,null,{"$f":"ROUND(AVERAGE(Y18:Y21),0)","v":1},{"$f":"ROUND(AVERAGE(Z18:Z21),0)","v":0},{"$f":"ROUND(AVERAGE(AA18:AA21),0)","v":1},{"$f":"ROUND(AVERAGE(AB18:AB21),0)","v":1},null,null,null,null,null,null,null,null,null,null,null,null,null,null,null,{"$f":"ROUND(AVERAGE(AR18:AR21),0)","v":2},{"$f":"ROUND(AVERAGE(AS18:AS21),0)","v":1},{"$f":"ROUND(AVERAGE(AT18:AT21),0)","v":1},{"$f":"ROUND(AVERAGE(AU18:AU21),0)","v":1},null,null,{"$f":"ROUND(AVERAGE(AX18:AX21),0)","v":1},{"$f":"ROUND(AVERAGE(AY18:AY21),0)","v":1},{"$f":"ROUND(AVERAGE(AZ18:AZ21),0)","v":1},{"$f":"ROUND(AVERAGE(BA18:BA21),0)","v":1},null,null,null,null,null,null,null,null,null,null,null,null,null,{"$f":"ROUND(AVERAGE(BO18:BO21),0)","v":2},{"$f":"ROUND(AVERAGE(BP18:BP21),0)","v":1},{"$f":"ROUND(AVERAGE(BQ18:BQ21),0)","v":1},{"$f":"ROUND(AVERAGE(BR18:BR21),0)","v":1}]