{"text_format":"1","workbook":"xlsx","n_sheets":15,"sheets":["Lozen","Betistuta MS","Betistuta İY","Nowgoal5","Betistuta Kullanımı","Nowgoal5 Kullanımı","MS","İY","Most","RUS","EV","DEP","0","1","2"],"not_rendered":{"charts":0,"images":6,"macros":0,"external_links":0,"defined_names":0,"comments":0,"pivot_tables":0},"unopened":[],"bounds":{"document_bytes":16777216,"sheet_cells":100000,"rows_first":2000,"rows_last":500,"rows_between":2000,"halvings":0,"cell_chars":16384,"cell_head_chars":4096},"cells_cut":0,"cells_raw":0,"read":"whole","date_system":"1900"}

{"sheet":"Lozen","index":0,"n_rows":29,"n_cols":28,"rows_kept":29,"cut":false,"hidden":false,"merged":[[15,25,16,28],[15,21,16,24],[27,18,27,20],[27,21,27,24],[27,25,27,28],[26,18,26,20],[26,21,26,22],[26,23,26,24],[26,25,26,26],[26,27,26,28],[25,18,25,20],[25,21,25,22],[25,23,25,24],[25,25,25,26],[25,27,25,28],[24,18,24,20],[24,21,24,22],[24,23,24,24],[24,25,24,26],[24,27,24,28],[22,18,22,20],[22,21,22,22],[22,23,22,24],[22,25,22,26],[22,27,22,28],[23,18,23,20],[23,21,23,22],[23,23,23,24],[23,25,23,26],[23,27,23,28],[21,21,21,22],[21,23,21,24],[21,25,21,26],[21,27,21,28],[21,18,21,20],[18,27,18,28],[20,21,20,22],[20,23,20,24],[20,25,20,26],[18,23,18,24],[20,27,20,28],[18,25,18,26],[19,21,19,22],[19,23,19,24],[19,25,19,26],[19,27,19,28],[20,18,20,20],[18,21,18,22],[18,18,18,20],[6,1,6,5],[18,1,18,5],[19,18,19,20],[15,18,16,20],[1,6,1,9],[2,1,4,3],[2,6,2,10],[3,6,3,10],[4,6,4,10]]}
[]
[null,"BAREM GİR  >>>",72.5,153.5,"EV SAHİBİ","DEPLASMAN","TAHMİNLER",null,null,null,{"$f":"CONCATENATE(IF(E4>F4,\"1\",\"2\"),\" / \",(IF(E5>F5,\"1\",\"2\")))","v":"2 / 1"},null,null,null,null,null,null,null,"http://betistuta.club/Basketbol.aspx"]
[null,"ANALİZ - SON 10 MAÇ ÜZERİNDEN",null,null,{"$f":"B7","v":"Virtus Bologna"},{"$f":"B19","v":"Olimpia Milano"},{"$f":"IF(E5+F5>D2,SUBSTITUTE(CONCATENATE(D2,\" - \",\"ÜST\"),\",\",\".\"),SUBSTITUTE(CONCATENATE(D2,\" - \",\"ALT\"),\",\",\".\"))","v":"153.5 - ALT"},null,null,null,null,null,null,null,null,null,null,null,"https://www.nowgoal5.com/basketball/analysis/473934"]
[{"$f":"INT(F4+E4)","v":88},null,null,null,{"$f":"INT(('Betistuta İY'!AB30+Nowgoal5!M59+Most!N16+'0'!G5+İY!AM13)/5+1)+5","v":43},{"$f":"INT(('Betistuta İY'!AD30+Nowgoal5!L59+Most!P16+'0'!G4+İY!AN13)/5+1)+5","v":45},{"$f":"CONCATENATE(\"HT:\",\"  \",A4)","v":"HT:  88"}]
[{"$f":"INT(E5+F5)","v":147},null,null,null,{"$f":"INT(('Betistuta MS'!AB30+Nowgoal5!P8+Most!T16+RUS!G4+MS!AM13)/5-1)","v":76},{"$f":"INT(('Betistuta MS'!AD30+Nowgoal5!S8+Most!V16+RUS!G5+MS!AN13)/5-1)","v":71},{"$f":"CONCATENATE(\"FT:\",\"  \",A5)","v":"FT:  147"}]
[]
[null,{"$f":"'Betistuta MS'!A25","v":"Virtus Bologna"},null,null,null,null,"SONUÇ",null,"İY","FORM","TOPLAM"]
[null,1,{"$f":"'Betistuta MS'!B48","v":"2022-06-08"},{"$f":"'Betistuta MS'!A48","v":"D"},{"$f":"'Betistuta MS'!C48","v":"Virtus Bolog"},{"$f":"'Betistuta MS'!E48","v":"Olimpia Mila"},{"$f":"'Betistuta MS'!D48","v":"62-66"},null,{"$f":"'Betistuta MS'!F48","v":"27-28"},{"$f":"MS!N2","v":"L"},{"$f":"EV!AT2","v":128}]
[null,2,{"$f":"'Betistuta MS'!B49","v":"2022-05-31"},{"$f":"'Betistuta MS'!A49","v":"D"},{"$f":"'Betistuta MS'!C49","v":"Tortona"},{"$f":"'Betistuta MS'!E49","v":"Virtus Bolog"},{"$f":"'Betistuta MS'!D49","v":"69-77"},null,{"$f":"'Betistuta MS'!F49","v":"33-47"},{"$f":"MS!N3","v":"W"},{"$f":"EV!AT3","v":146}]
[null,3,{"$f":"'Betistuta MS'!B50","v":"2022-05-29"},{"$f":"'Betistuta MS'!A50","v":"D"},{"$f":"'Betistuta MS'!C50","v":"Virtus Bolog"},{"$f":"'Betistuta MS'!E50","v":"Tortona"},{"$f":"'Betistuta MS'!D50","v":"91-70"},null,{"$f":"'Betistuta MS'!F50","v":"41-35"},{"$f":"MS!N4","v":"W"},{"$f":"EV!AT4","v":161}]
[null,4,{"$f":"'Betistuta MS'!B51","v":"2022-05-27"},{"$f":"'Betistuta MS'!A51","v":"D"},{"$f":"'Betistuta MS'!C51","v":"Virtus Bolog"},{"$f":"'Betistuta MS'!E51","v":"Tortona"},{"$f":"'Betistuta MS'!D51","v":"77-73"},null,{"$f":"'Betistuta MS'!F51","v":"35-38"},{"$f":"MS!N5","v":"W"},{"$f":"EV!AT5","v":150}]
[null,5,{"$f":"'Betistuta MS'!B52","v":"2022-05-19"},{"$f":"'Betistuta MS'!A52","v":"D"},{"$f":"'Betistuta MS'!C52","v":"Pesaro"},{"$f":"'Betistuta MS'!E52","v":"Virtus Bolog"},{"$f":"'Betistuta MS'!D52","v":"55-75"},null,{"$f":"'Betistuta MS'!F52","v":"35-35"},{"$f":"MS!N6","v":"W"},{"$f":"EV!AT6","v":130}]
[null,6,{"$f":"'Betistuta MS'!B53","v":"2022-05-17"},{"$f":"'Betistuta MS'!A53","v":"D"},{"$f":"'Betistuta MS'!C53","v":"Virtus Bolog"},{"$f":"'Betistuta MS'!E53","v":"Pesaro"},{"$f":"'Betistuta MS'!D53","v":"70-51"},null,{"$f":"'Betistuta MS'!F53","v":"31-25"},{"$f":"MS!N7","v":"W"},{"$f":"EV!AT7","v":121}]
[null,7,{"$f":"'Betistuta MS'!B54","v":"2022-05-15"},{"$f":"'Betistuta MS'!A54","v":"D"},{"$f":"'Betistuta MS'!C54","v":"Virtus Bolog"},{"$f":"'Betistuta MS'!E54","v":"Pesaro"},{"$f":"'Betistuta MS'!D54","v":"82-76"},null,{"$f":"'Betistuta MS'!F54","v":"45-36"},{"$f":"MS!N8","v":"W"},{"$f":"EV!AT8","v":158}]
[null,8,{"$f":"'Betistuta MS'!B55","v":"2022-05-11"},{"$f":"'Betistuta MS'!A55","v":"D"},{"$f":"'Betistuta MS'!C55","v":"Virtus Bolog"},{"$f":"'Betistuta MS'!E55","v":"Bursaspor"},{"$f":"'Betistuta MS'!D55","v":"80-67"},null,{"$f":"'Betistuta MS'!F55","v":"41-31"},{"$f":"MS!N9","v":"W"},{"$f":"EV!AT9","v":147}]
[null,9,{"$f":"'Betistuta MS'!B56","v":"2022-05-08"},{"$f":"'Betistuta MS'!A56","v":"D"},{"$f":"'Betistuta MS'!C56","v":"Virtus Bolog"},{"$f":"'Betistuta MS'!E56","v":"Brescia"},{"$f":"'Betistuta MS'!D56","v":"79-57"},null,{"$f":"'Betistuta MS'!F56","v":"42-24"},{"$f":"MS!N10","v":"W"},{"$f":"EV!AT10","v":136},null,null,null,null,null,null,null,{"$f":"Nowgoal5!AC7","v":"BELİRSİZ"},null,null,{"$f":"Nowgoal5!AD7","v":"ARALIK"},null,null,null,{"$f":"Nowgoal5!AE7","v":"DİKKAT"}]
[null,10,{"$f":"'Betistuta MS'!B57","v":"2022-05-06"},{"$f":"'Betistuta MS'!A57","v":"D"},{"$f":"'Betistuta MS'!C57","v":"Sassari"},{"$f":"'Betistuta MS'!E57","v":"Virtus Bolog"},{"$f":"'Betistuta MS'!D57","v":"108-73"},null,{"$f":"'Betistuta MS'!F57","v":"47-35"},{"$f":"MS!N11","v":"L"},{"$f":"EV!AT11","v":181}]
[]
[null,{"$f":"'Betistuta MS'!A27","v":"Olimpia Milano"},null,null,null,null,"SONUÇ",null,"İY","FORM","TOPLAM",null,null,null,null,null,null,null,"ANALİZ ÖZETLERİ",null,null,{"$f":"E3","v":"Virtus Bologna"},null,{"$f":"F3","v":"Olimpia Milano"},null,{"$f":"V19","v":"Virtus Bologna"},null,{"$f":"X19","v":"Olimpia Milano"}]
[null,1,{"$f":"'Betistuta MS'!B67","v":"2022-06-08"},{"$f":"'Betistuta MS'!A67","v":"D"},{"$f":"'Betistuta MS'!C67","v":"Virtus Bolog"},{"$f":"'Betistuta MS'!E67","v":"Olimpia Mila"},{"$f":"'Betistuta MS'!D67","v":"62-66"},null,{"$f":"'Betistuta MS'!F67","v":"27-28"},{"$f":"MS!N16","v":"W"},{"$f":"DEP!AT2","v":128},null,null,null,null,null,null,null,"  MOST ANALİZİ",null,null,{"$f":"Most!N16","v":42},null,{"$f":"Most!P16","v":39},null,{"$f":"Most!T16","v":78},null,{"$f":"Most!V16","v":76}]
[null,2,{"$f":"'Betistuta MS'!B68","v":"2022-06-01"},{"$f":"'Betistuta MS'!A68","v":"D"},{"$f":"'Betistuta MS'!C68","v":"Sassari"},{"$f":"'Betistuta MS'!E68","v":"Olimpia Mila"},{"$f":"'Betistuta MS'!D68","v":"69-87"},null,{"$f":"'Betistuta MS'!F68","v":"34-47"},{"$f":"MS!N17","v":"W"},{"$f":"DEP!AT3","v":156},null,null,null,null,null,null,null,"  BETİSTUTA ANALİZİ #1",null,null,{"$f":"'Betistuta İY'!AB30","v":40},null,{"$f":"'Betistuta İY'!AD30","v":39},null,{"$f":"'Betistuta MS'!AB30","v":72},null,{"$f":"'Betistuta MS'!AD30","v":76}]
[null,3,{"$f":"'Betistuta MS'!B69","v":"2022-05-30"},{"$f":"'Betistuta MS'!A69","v":"D"},{"$f":"'Betistuta MS'!C69","v":"Olimpia Mila"},{"$f":"'Betistuta MS'!E69","v":"Sassari"},{"$f":"'Betistuta MS'!D69","v":"91-82"},null,{"$f":"'Betistuta MS'!F69","v":"41-49"},{"$f":"MS!N18","v":"W"},{"$f":"DEP!AT4","v":173},null,null,null,null,null,null,null,"  BETİSTUTA ANALİZİ #2",null,null,{"$f":"'0'!G4","v":43},null,{"$f":"'0'!G5","v":37},null,{"$f":"RUS!G4","v":81},null,{"$f":"RUS!G5","v":69}]
[null,4,{"$f":"'Betistuta MS'!B70","v":"2022-05-28"},{"$f":"'Betistuta MS'!A70","v":"D"},{"$f":"'Betistuta MS'!C70","v":"Olimpia Mila"},{"$f":"'Betistuta MS'!E70","v":"Sassari"},{"$f":"'Betistuta MS'!D70","v":"88-71"},null,{"$f":"'Betistuta MS'!F70","v":"50-42"},{"$f":"MS!N19","v":"W"},{"$f":"DEP!AT5","v":159},null,null,null,null,null,null,null,"  BETİSTUTA ANALİZİ #3",null,null,{"$f":"İY!AM13","v":38},null,{"$f":"İY!AN13","v":36},null,{"$f":"MS!AM13","v":75},null,{"$f":"MS!AN13","v":73}]
[null,5,{"$f":"'Betistuta MS'!B71","v":"2022-05-19"},{"$f":"'Betistuta MS'!A71","v":"D"},{"$f":"'Betistuta MS'!C71","v":"Reggiana"},{"$f":"'Betistuta MS'!E71","v":"Olimpia Mila"},{"$f":"'Betistuta MS'!D71","v":"59-89"},null,{"$f":"'Betistuta MS'!F71","v":"27-43"},{"$f":"MS!N20","v":"W"},{"$f":"DEP!AT6","v":148},null,null,null,null,null,null,null,"  NOWGOAL5 ANALİZİ",null,null,{"$f":"Nowgoal5!M59","v":30},null,{"$f":"Nowgoal5!L59","v":39},null,{"$f":"Nowgoal5!P8","v":79},null,{"$f":"Nowgoal5!S8","v":66}]
[null,6,{"$f":"'Betistuta MS'!B72","v":"2022-05-17"},{"$f":"'Betistuta MS'!A72","v":"D"},{"$f":"'Betistuta MS'!C72","v":"Olimpia Mila"},{"$f":"'Betistuta MS'!E72","v":"Reggiana"},{"$f":"'Betistuta MS'!D72","v":"91-65"},null,{"$f":"'Betistuta MS'!F72","v":"57-32"},{"$f":"MS!N21","v":"W"},{"$f":"DEP!AT7","v":156},null,null,null,null,null,null,null,"  ORTALAMA ANALİZ",null,null,{"$f":"SUM(V20:W24)/5","v":38.6},null,{"$f":"SUM(X20:Y24)/5","v":38},null,{"$f":"SUM(Z20:AA24)/5","v":77},null,{"$f":"SUM(AB20:AC24)/5","v":72}]
[null,7,{"$f":"'Betistuta MS'!B73","v":"2022-05-15"},{"$f":"'Betistuta MS'!A73","v":"D"},{"$f":"'Betistuta MS'!C73","v":"Olimpia Mila"},{"$f":"'Betistuta MS'!E73","v":"Reggiana"},{"$f":"'Betistuta MS'!D73","v":"91-82"},null,{"$f":"'Betistuta MS'!F73","v":"51-40"},{"$f":"MS!N22","v":"W"},{"$f":"DEP!AT8","v":173},null,null,null,null,null,null,null,"  GENEL ANALİZ",null,null,{"$f":"E4","v":43},null,{"$f":"F4","v":45},null,{"$f":"E5","v":76},null,{"$f":"F5","v":71}]
[null,8,{"$f":"'Betistuta MS'!B74","v":"2022-05-08"},{"$f":"'Betistuta MS'!A74","v":"D"},{"$f":"'Betistuta MS'!C74","v":"Venezia"},{"$f":"'Betistuta MS'!E74","v":"Olimpia Mila"},{"$f":"'Betistuta MS'!D74","v":"69-74"},null,{"$f":"'Betistuta MS'!F74","v":"41-32"},{"$f":"MS!N23","v":"W"},{"$f":"DEP!AT9","v":143},null,null,null,null,null,null,null,"SONUÇ",null,null,{"$f":"SUM(V25:W26)/2","v":40.799999999999997},null,{"$f":"SUM(X25:Y26)/2","v":41.5},null,{"$f":"SUM(Z25:AA26)/2","v":76.5},null,{"$f":"SUM(AB25:AC26)/2","v":71.5}]
[null,9,{"$f":"'Betistuta MS'!B75","v":"2022-05-04"},{"$f":"'Betistuta MS'!A75","v":"D"},{"$f":"'Betistuta MS'!C75","v":"Treviso"},{"$f":"'Betistuta MS'!E75","v":"Olimpia Mila"},{"$f":"'Betistuta MS'!D75","v":"80-74"},null,{"$f":"'Betistuta MS'!F75","v":"29-32"},{"$f":"MS!N24","v":"L"},{"$f":"DEP!AT10","v":154},null,null,null,null,null,null,null,"ALT / ÜST",null,null,{"$f":"IF(V27+X27>C2,\"İLK YARI ÜST\",\"İLK YARI ALT\")","v":"İLK YARI ÜST"},null,null,null,{"$f":"IF(Z27+AB27>D2,\"MAÇ SONUCU ÜST\",\"MAÇ SONUCU ALT\")","v":"MAÇ SONUCU ALT"}]
[null,10,{"$f":"'Betistuta MS'!B76","v":"2022-05-01"},{"$f":"'Betistuta MS'!A76","v":"D"},{"$f":"'Betistuta MS'!C76","v":"Olimpia Mila"},{"$f":"'Betistuta MS'!E76","v":"Brindisi"},{"$f":"'Betistuta MS'!D76","v":"92-87"},null,{"$f":"'Betistuta MS'!F76","v":"44-50"},{"$f":"MS!N25","v":"W"},{"$f":"DEP!AT11","v":179}]

{"sheet":"Betistuta MS","index":1,"n_rows":157,"n_cols":38,"rows_kept":157,"cut":false,"hidden":false,"merged":[[65,16,65,17],[27,29,28,29],[29,29,30,29],[29,27,30,27],[27,28,28,28],[29,28,30,28],[46,16,46,17],[0,12,3,12],[0,13,3,13],[27,26,30,26],[27,25,30,25],[27,27,28,27],[0,14,3,14]]}
[null,null,null,null,null,null,null,null,null,null,null,null,"BAREM",{"$f":"Lozen!D2","v":153.5},{"$f":"Lozen!C2","v":72.5}]
[]
[]
["Skip Navigation Links"]
[]
["Betistuta"]
["Futbol"]
["Basketbol"]
["Voleybol"]
["Hentbol"]
["BuzHokeyi"]
["Beyzbol"]
["Tenis"]
["BOYZ(F)"]
["BOYZ(B)"]
["Orandelli"]
["Gol Oldu mu ?"]
["Iletisim"]
[" "," "]
[]
["Italy -Lega A"]
[]
["10.06.2022-21:00"]
[null," "," "]
["Virtus Bologna"]
[]
["Olimpia Milano"]
[null,null,null,null,null,null,null,null,null,null,null,null,"SKOR 1",{"$f":"((X53*X51)+(X73*X51))*0.5","v":75.249019607843138},{"$f":"((X72*X70)+(X54*X70))*0.5","v":78.548064304461946},{"$f":"MROUND(SUM(N28,O28),1)","v":154},{"$f":"ABS(N28-O28)","v":3.2990446966188074},{"$f":"T57","v":85.1},{"$f":"T76","v":91.8},{"$f":"MROUND(SUM(R28,S28),1)","v":177},{"$f":"ABS(R28-S28)","v":6.7000000000000028},"EV",null,"DEP",null,"BAREM",{"$f":"N1","v":153.5},{"$f":"AB48","v":"Virtus Bologna"},{"$f":"AB30+AD30","v":148},{"$f":"AD48","v":"Olimpia Milano"},"ALT","ÜST","MS1","MS2","EV - FORM","DEP - FORM","EV SAYI","DEP SAYI"]
[" ",null,null,null,null,null,null,null,null,null,null,null,"SKOR2",{"$f":"((X53*X51)+(X69*X51))*0.5","v":74.037023035435254},{"$f":"((X72*X70)+(X50*X70))*0.5","v":79.718986290277542},{"$f":"MROUND(SUM(N29,O29),1)","v":154},{"$f":"ABS(N29-O29)","v":5.6819632548422874},{"$f":"N32","v":73.315512374615651},{"$f":"O32","v":75.27722364159267},{"$f":"MROUND(SUM(R29,S29),1)","v":149},{"$f":"ABS(R29-S29)","v":1.9617112669770194},{"$f":"IFERROR(VALUE(LEFT(D136,SEARCH(\"-\",D136,1)-1)),\"\")","v":62},null,{"$f":"IFERROR(VALUE(RIGHT(D136,LEN(D136)-SEARCH(\"-\",D136,SEARCH(\"-\",D136,1)-1))),\"\")","v":66},null,null,null,null,null,null,{"$f":"1-AF29","v":0.65256369451697749},{"$f":"_xlfn.POISSON.DIST(AC28,AA28,TRUE)","v":0.34743630548302257},{"$f":"_xlfn.POISSON.DIST(AB30,AD30,TRUE)","v":0.35000002245069439},{"$f":"1-AG29","v":0.64999997754930561},{"$f":"COUNTIF(V48:V57,\"W\")/10-2.28%","v":0.7772},{"$f":"COUNTIF(V67:V76,\"W\")/10-2.28%","v":0.87719999999999998},{"$f":"R31","v":79},{"$f":"S31","v":84}]
["Beklenen Skor IY/MS",null,null,null,null,null,null,null,null,null,null,null,"SKOR3",{"$f":"X51*X69","v":70.109340188517564},{"$f":"X50*X70","v":70.075177304964541},140,3.4162883553022994E-2,{"$f":"AVERAGE(R28:R29)","v":79.207756187307822},{"$f":"AVERAGE(S28:S29)","v":83.538611820796334},{"$f":"MROUND(SUM(R30,S30),1)","v":163},{"$f":"ABS(R30-S30)","v":4.3308556334885111},{"$f":"IFERROR(VALUE(LEFT(D137,SEARCH(\"-\",D137,1)-1)),\"\")","v":83},null,{"$f":"IFERROR(VALUE(RIGHT(D137,LEN(D137)-SEARCH(\"-\",D137,SEARCH(\"-\",D137,1)-1))),\"\")","v":65},null,null,null,{"$f":"AB54-1","v":72},{"$f":"U31","v":5},{"$f":"AD54-1","v":76},"ALT - GÜVEN","ÜST - GÜVEN","MİN. SAYI","MAK. SAYI","MİN. FARK","MAK. FARK","EV SON SAYI","DEP SON SAYI"]
["39-36  / 75-76",null,null,null,null,null,null,null,null,null,null,null,"SKOR4",{"$f":"(X51+X71)*0.5","v":73.866666666666674},{"$f":"(X52+X70)*0.5","v":72.766666666666666},147,1.1000000000000085,{"$f":"MROUND(R30,1)","v":79},{"$f":"MROUND(S30,1)","v":84},{"$f":"MROUND(T30,1)","v":163},{"$f":"ABS(R31-S31)","v":5},{"$f":"IFERROR(VALUE(LEFT(D138,SEARCH(\"-\",D138,1)-1)),\"\")","v":73},null,{"$f":"IFERROR(VALUE(RIGHT(D138,LEN(D138)-SEARCH(\"-\",D138,SEARCH(\"-\",D138,1)-1))),\"\")","v":62},null,null,null,null,null,null,{"$f":"1-AF31","v":5.2799999999999958E-2},{"$f":"((COUNTIF(U67:U76,\"UST\"))+(COUNTIF(U48:U57,\"UST\")))/20-5.28%","v":0.94720000000000004},{"$f":"INT(R32+AL54/2)","v":146},{"$f":"INT(T32+AL54)","v":189},{"$f":"AL52","v":4},{"$f":"AL53","v":18},{"$f":"INT(AL29-AL54+(AI52*AI29)/5.5)","v":89},{"$f":"INT(AK29-AL54+(AI52*AJ29)/5.5)","v":86}]
["19-18,20-18,18-22,18-18",null,null,null,null,null,null,null,null,null,null,null,"ORTALAMA",{"$f":"AVERAGE(N28:N31)","v":73.315512374615651},{"$f":"AVERAGE(O28:O31)","v":75.27722364159267},148.75,2.5287927087535316,{"$f":"MROUND(MIN(T28:T31,P28:P31),1)","v":140},{"$f":"MROUND(MIN(U28:U31,Q28:Q31),1)","v":0},{"$f":"MROUND(MAX(T28:T31,P28:P31),1)","v":177},{"$f":"MROUND(MAX(U28:U31,Q28:Q31),1)","v":7},{"$f":"IFERROR(VALUE(LEFT(D139,SEARCH(\"-\",D139,1)-1)),\"\")","v":76},null,{"$f":"IFERROR(VALUE(RIGHT(D139,LEN(D139)-SEARCH(\"-\",D139,SEARCH(\"-\",D139,1)-1))),\"\")","v":58}]
[" ",null,null,null,null,null,null,null,null,null,null,null,null,null,null,null,null,null,null,null,null,{"$f":"IFERROR(VALUE(LEFT(D140,SEARCH(\"-\",D140,1)-1)),\"\")","v":68},null,{"$f":"IFERROR(VALUE(RIGHT(D140,LEN(D140)-SEARCH(\"-\",D140,SEARCH(\"-\",D140,1)-1))),\"\")","v":73}]
[" ","Takım Gücü  IY/MS"]
["460.6 /673.7","Maç Sonucu"]
["39-38  / 75-68"]
["18-23,21-15,17-16,19-14","Takım Gücü  IY/MS"]
["421 /648"," "]
[" ","Sonraki Maç"]
["6/12/2022-D-Olimpia Milano"]
["Lega A",null,"Sonraki Maç"]
["6/12/2022-E-Virtus Bologna"]
["Lega A"," "]
[" "]
[" "]
[" "," ",null," "," "]
[" ","Tarih","EvSahibi","MS","Deplasman","İY",null,null,null,null,null,null,"EV","DEP","EVİN ATTIĞI","EVİN YEDİĞİ","EV SKOR",null,null,null,null,null,"EV'İN TOPLAM ATTIĞI",{"$f":"Q63","v":1128},null,{"$f":"A134","v":"Rekabet Analizi"},"TARİH","EV SAHİBİ","MS","DEPLASMAN","İY","LİG","EV","DEP","TOPLAM","ALT / ÜST","MAÇ SONUCU","HANDİKAP"]
["D","2022-06-08","Virtus Bolog","62-66","Olimpia Mila","27-28",null,null,null,null,null,null,{"$f":"IFERROR(VALUE(LEFT(D48,SEARCH(\"-\",D48,1)-1)),\"\")","v":62},{"$f":"IFERROR(VALUE(RIGHT(D48,LEN(D48)-SEARCH(\"-\",D48,SEARCH(\"-\",D48,1)-1))),\"\")","v":66},{"$f":"IF(OR(M48=\"\",N48=\"\"),\"\",IF(C48=$C$86,M48,N48))","v":62},{"$f":"IF(OR(M48=\"\",N48=\"\"),\"\",IF(C48=$C$86,N48,M48))","v":66},{"$f":"O48","v":62},{"$f":"P48","v":66},{"$f":"AVERAGE(Q48:Q57)+3.5","v":80.099999999999994},{"$f":"IF(Q48>R48,S48+1,S48-1.5)","v":78.599999999999994},{"$f":"IF(AND(Q48+R48>$K$10),\"UST\",\"ALT\")","v":"UST"},{"$f":"IF(Q48>R48,\"W\",\"\")","v":""},"EV'İN TOPLAM YEDİĞİ",{"$f":"R63","v":1016},null,null,{"$f":"B136","v":"2022-06-08"},{"$f":"C136","v":"Virtus Bologna"},"62-66","Olimpia Milano","27-28","Lega A",{"$f":"V29","v":62},{"$f":"X29","v":66},{"$f":"AG48+AH48","v":128},{"$f":"IF(AI48=\"\",\"\",IF(AI48>$AA$28,\"UST\",\"ALT\"))","v":"ALT"},{"$f":"IF(AG48>AH48,\"MS1\",IF(AH48>AG48,\"MS2\",\"\"))","v":"MS2"},{"$f":"IFERROR(ABS(AG48-AH48),\"\")","v":4}]
["D","2022-05-31","Tortona","69-77","Virtus Bolog","33-47",null,null,null,null,null,null,{"$f":"IFERROR(VALUE(LEFT(D49,SEARCH(\"-\",D49,1)-1)),\"\")","v":69},{"$f":"IFERROR(VALUE(RIGHT(D49,LEN(D49)-SEARCH(\"-\",D49,SEARCH(\"-\",D49,1)-1))),\"\")","v":77},{"$f":"IF(OR(M49=\"\",N49=\"\"),\"\",IF(C49=$C$86,M49,N49))","v":77},{"$f":"IF(OR(M49=\"\",N49=\"\"),\"\",IF(C49=$C$86,N49,M49))","v":69},{"$f":"O49","v":77},{"$f":"P49","v":69},null,{"$f":"IF(Q49>R49,T48+1,T48-1.5)","v":79.599999999999994},"UST",{"$f":"IF(Q49>R49,\"W\",\"\")","v":"W"},"EV ATTIĞI / EV YEDİĞİ",{"$f":"X47/X48","v":1.110236220472441},null,null,{"$f":"B137","v":"2022-04-10"},{"$f":"C137","v":"Virtus Bologna"},{"$f":"D137","v":"83-65"},{"$f":"E137","v":"Olimpia Milano"},{"$f":"F137","v":"46-34"},{"$f":"G137","v":"Lega A"},{"$f":"V30","v":83},{"$f":"X30","v":65},{"$f":"AG49+AH49","v":148},{"$f":"IF(AI49=\"\",\"\",IF(AI49>$AA$28,\"UST\",\"ALT\"))","v":"ALT"},{"$f":"IF(AG49>AH49,\"MS1\",IF(AH49>AG49,\"MS2\",\"\"))","v":"MS1"},{"$f":"IFERROR(ABS(AG49-AH49),\"\")","v":18}]
["D","2022-05-29","Virtus Bolog","91-70","Tortona","41-35",null,null,null,null,null,null,91,70,91,70,91,70,null,{"$f":"IF(Q50>R50,T49+1,T49-1.5)","v":80.599999999999994},"UST",{"$f":"IF(Q50>R50,\"W\",\"\")","v":"W"},"EV YEDİĞİ / EV ATTIĞI",{"$f":"X48/X47","v":0.900709219858156},null,null,"2021-06-11","Virtus Bologna","73-62","Olimpia Milano","41-43","Lega A",73,62,135,{"$f":"IF(AI50=\"\",\"\",IF(AI50>$AA$28,\"UST\",\"ALT\"))","v":"ALT"},"MS1",11]
["D","2022-05-27","Virtus Bolog","77-73","Tortona","35-38",null,null,null,null,null,null,77,73,77,73,77,73,null,{"$f":"IF(Q51>R51,T50+1,T50-1.5)","v":81.599999999999994},"UST","W","EV'İN ORT. ATTIĞI",{"$f":"AVERAGE(Q48:Q62)","v":75.2},null,null,"2021-06-09","Virtus Bologna","76-58","Olimpia Milano","37-34","Lega A",76,58,{"$f":"AG51+AH51","v":134},{"$f":"IF(AI51=\"\",\"\",IF(AI51>$AA$28,\"UST\",\"ALT\"))","v":"ALT"},"MS1",18]
["D","2022-05-19","Pesaro","55-75","Virtus Bolog","35-35",null,null,null,null,null,null,55,75,75,55,75,55,null,82.6,"UST","W","EV'İN ORT. YEDİĞİ",{"$f":"AVERAGE(R48:R62)","v":67.733333333333334},null,null,null,null,null,null,null,null,null,"MIN",{"$f":"MIN(AI48:AI51)","v":128},null,null,{"$f":"MIN(AL48:AL51)","v":4}]
["D","2022-05-17","Virtus Bolog","70-51","Pesaro","31-25",null,null,null,null,null,null,70,51,70,51,70,51,null,83.6,"UST","W","EV'İN TOPLAM ATTIĞI / DEP'İN TOPLAM YEDİĞİ",{"$f":"X47/X67","v":1.036764705882353},null,null,null,null,null,null,null,null,null,"MAX",{"$f":"MAX(AI48:AI51)","v":148},null,null,{"$f":"MAX(AL48:AL51)","v":18}]
["D","2022-05-15","Virtus Bolog","82-76","Pesaro","45-36",null,null,null,null,null,null,82,76,82,76,82,76,null,84.6,"UST","W","EV'İN TOPLAM YEDİĞİ / DEP'İN TOPLAM ATTIĞI",{"$f":"X48/X66","v":0.87060839760068554},null,null,null,{"$f":"INT((AK29+AL31)/2-AL54/1.5)-1","v":73},null,{"$f":"INT((AL29+AK31)/2-AL54/1.5)-1","v":77},null,null,null,"ORT.",{"$f":"AVERAGE(AI48:AI51)","v":136.25},null,null,{"$f":"AVERAGE(AL48:AL51)","v":12.75}]
["D","2022-05-11","Virtus Bolog","80-67","Bursaspor","41-31",null,null,null,null,null,null,80,67,80,67,80,67,null,85.6,"UST","W"]
["D","2022-05-08","Virtus Bolog","79-57","Brescia","42-24",null,null,null,null,null,null,79,57,79,57,79,57,null,86.6,"UST","W"]
["D","2022-05-06","Sassari","108-73","Virtus Bolog","47-35",null,null,null,null,null,null,108,73,73,108,73,108,null,{"$f":"IF(Q57>R57,T56+1,T56-1.5)","v":85.1},"UST",""]
["D","2022-05-04","Valencia","73-83","Virtus Bolog","38-50",null,null,null,null,null,null,73,83,83,73,{"$f":"V29","v":62},{"$f":"X29","v":66}]
["D","2022-04-29","Treviso","76-113","Virtus Bolog","34-52",null,null,null,null,null,null,76,113,113,76,{"$f":"V30","v":83},{"$f":"X30","v":65}]
["D","2022-04-26","Virtus Bolog","83-77","Ulm","43-45",null,null,null,null,null,null,83,77,83,77,{"$f":"V31","v":73},{"$f":"X31","v":62}]
["D","2022-04-22","Virtus Bolog","101-83","Tortona","49-53",null,null,null,null,null,null,101,83,101,83,{"$f":"V32","v":76},{"$f":"X32","v":58}]
["D","2022-04-20","Virtus Bolog","75-67","Lietkabelis","39-34",null,null,null,null,null,null,75,67,75,67,{"$f":"V33","v":68},{"$f":"X33","v":73}]
[" ","G","M","AS","YS",null,null,null,null,null,null,null,{"$f":"SUM(M48:M62)","v":1181},{"$f":"SUM(N48:N62)","v":1108},{"$f":"SUM(O48:O62)","v":1221},{"$f":"SUM(P48:P62)","v":1068},{"$f":"SUM(Q48:Q62)","v":1128},{"$f":"SUM(R48:R62)","v":1016},80.099999999999994,828.50000000000011]
["İlk Yarı",9,5,612,536]
["Maç Sonu",13,2,1221,1068]
[" ","Tarih","EvSahibi","MS","Deplasman","İY",null,null,null,null,null,null,"EV","DEP","DEP'İN ATTIĞI","DEP'İN YEDİĞİ","DEP SKOR",null,null,null,null,null,"DEP'İN TOPLAM ATTIĞI",{"$f":"Q82","v":1167}]
["D","2022-06-08","Virtus Bolog","62-66","Olimpia Mila","27-28",null,null,null,null,null,null,{"$f":"IFERROR(VALUE(LEFT(D67,SEARCH(\"-\",D67,1)-1)),\"\")","v":62},{"$f":"IFERROR(VALUE(RIGHT(D67,LEN(D67)-SEARCH(\"-\",D67,SEARCH(\"-\",D67,1)-1))),\"\")","v":66},{"$f":"IF(OR(M67=\"\",N67=\"\"),\"\",IF(C67=$E$110,M67,N67))","v":66},{"$f":"IF(OR(M67=\"\",N67=\"\"),\"\",IF(C67=$E$110,N67,M67))","v":62},{"$f":"O67","v":66},{"$f":"P67","v":62},{"$f":"AVERAGE(Q67:Q76)","v":84.3},{"$f":"IF(Q67>R67,S67+1,S67-1.5)","v":85.3},{"$f":"IF(AND(Q67+R67>$K$10),\"UST\",\"ALT\")","v":"UST"},{"$f":"IF(Q67>R67,\"W\",\"\")","v":"W"},"DEP'İN TOPLAM YEDİĞİ",{"$f":"R82","v":1088}]
["D","2022-06-01","Sassari","69-87","Olimpia Mila","34-47",null,null,null,null,null,null,{"$f":"IFERROR(VALUE(LEFT(D68,SEARCH(\"-\",D68,1)-1)),\"\")","v":69},{"$f":"IFERROR(VALUE(RIGHT(D68,LEN(D68)-SEARCH(\"-\",D68,SEARCH(\"-\",D68,1)-1))),\"\")","v":87},{"$f":"IF(OR(M68=\"\",N68=\"\"),\"\",IF(C68=$E$110,M68,N68))","v":87},{"$f":"IF(OR(M68=\"\",N68=\"\"),\"\",IF(C68=$E$110,N68,M68))","v":69},87,69,null,{"$f":"IF(Q68>R68,T67+1,T67-1.5)","v":86.3},"UST","W","DEP ATTIĞI / DEP YEDİĞİ",{"$f":"X66/X67","v":1.072610294117647}]
["D","2022-05-30","Olimpia Mila","91-82","Sassari","41-49",null,null,null,null,null,null,91,82,91,82,91,82,null,{"$f":"IF(Q69>R69,T68+1,T68-1.5)","v":87.3},"UST","W","DEP YEDİĞİ / DEP ATTIĞI",{"$f":"X67/X66","v":0.93230505569837185}]
["D","2022-05-28","Olimpia Mila","88-71","Sassari","50-42",null,null,null,null,null,null,88,71,88,71,88,71,null,{"$f":"IF(Q70>R70,T69+1,T69-1.5)","v":88.3},"UST","W","DEP'İN ORT. ATTIĞI",{"$f":"AVERAGE(Q67:Q81)","v":77.8}]
["D","2022-05-19","Reggiana","59-89","Olimpia Mila","27-43",null,null,null,null,null,null,59,89,89,59,89,59,null,89.3,"UST","W","DEP'İN ORT. YEDİĞİ",{"$f":"AVERAGE(R67:R81)","v":72.533333333333331}]
["D","2022-05-17","Olimpia Mila","91-65","Reggiana","57-32",null,null,null,null,null,null,91,65,91,65,91,65,null,90.3,"UST","W","DEP'İN TOPLAM ATTIĞI / EV'İN TOPLAM YEDİĞİ",{"$f":"X66/X48","v":1.1486220472440944}]
["D","2022-05-15","Olimpia Mila","91-82","Reggiana","51-40",null,null,null,null,null,null,91,82,91,82,91,82,null,91.3,"UST","W","DEP'İN TOPLAM YEDİĞİ / EV'İN TOPLAM ATTIĞI",{"$f":"X67/X47","v":0.96453900709219853}]
["D","2022-05-08","Venezia","69-74","Olimpia Mila","41-32",null,null,null,null,null,null,69,74,74,69,74,69,null,92.3,"UST","W"]
["D","2022-05-04","Treviso","80-74","Olimpia Mila","29-32",null,null,null,null,null,null,80,74,74,80,74,80,null,90.8,"UST",""]
["D","2022-05-01","Olimpia Mila","92-87","Brindisi","44-50",null,null,null,null,null,null,92,87,92,87,92,87,null,{"$f":"IF(Q76>R76,T75+1,T75-1.5)","v":91.8},"UST","W"]
["D","2022-04-28","Anadolu Efes","75-70","Olimpia Mila","42-43",null,null,null,null,null,null,75,70,70,75,{"$f":"X29","v":66},{"$f":"V29","v":62}]
["D","2022-04-26","Anadolu Efes","77-65","Olimpia Mila","42-35",null,null,null,null,null,null,77,65,65,77,{"$f":"X30","v":65},{"$f":"V30","v":83}]
["D","2022-04-23","Reggiana","63-67","Olimpia Mila","29-39",null,null,null,null,null,null,63,67,67,63,{"$f":"X31","v":62},{"$f":"V31","v":73}]
["D","2022-04-21","Olimpia Mila","73-66","Anadolu Efes","33-33",null,null,null,null,null,null,73,66,73,66,{"$f":"X32","v":58},{"$f":"V32","v":76}]
["D","2022-04-19","Olimpia Mila","48-64","Anadolu Efes","26-29",null,null,null,null,null,null,48,64,48,64,{"$f":"X33","v":73},{"$f":"V33","v":68}]
[" ","G","M","AS","YS",null,null,null,null,null,null,null,{"$f":"SUM(M67:M81)","v":1128},{"$f":"SUM(N67:N81)","v":1109},{"$f":"SUM(O67:O81)","v":1166},{"$f":"SUM(P67:P81)","v":1071},{"$f":"SUM(Q67:Q81)","v":1167},{"$f":"SUM(R67:R81)","v":1088},{"$f":"SUM(S67:S81)","v":84.3},{"$f":"SUM(T67:T81)","v":892.99999999999977}]
["İlk Yarı",9,5,601,546]
["Maç Sonu",11,4,1166,1071]
[" ","Tarih","EvSahibi","MS","Deplasman","İY"]
["D","2022-06-08","Virtus Bolog","62-66","Olimpia Mila","27-28"]
["D","2022-05-29","Virtus Bolog","91-70","Tortona","41-35"]
["D","2022-05-27","Virtus Bolog","77-73","Tortona","35-38"]
["D","2022-05-17","Virtus Bolog","70-51","Pesaro","31-25"]
["D","2022-05-15","Virtus Bolog","82-76","Pesaro","45-36"]
["D","2022-05-11","Virtus Bolog","80-67","Bursaspor","41-31"]
["D","2022-05-08","Virtus Bolog","79-57","Brescia","42-24"]
["D","2022-04-26","Virtus Bolog","83-77","Ulm","43-45"]
["D","2022-04-22","Virtus Bolog","101-83","Tortona","49-53"]
["D","2022-04-20","Virtus Bolog","75-67","Lietkabelis","39-34"]
["D","2022-04-13","Virtus Bolog","82-82","Trento","47-35"]
["D","2022-04-10","Virtus Bolog","83-65","Olimpia Mila","46-34"]
["D","2022-03-29","Virtus Bolog","70-68","Gran Canaria","36-35"]
["D","2022-03-26","Virtus Bolog","78-70","Reggiana","34-26"]
["D","2022-03-20","Virtus Bolog","81-77","Venezia","31-44"]
["D","2022-03-16","Virtus Bolog","74-86","Cedevita Oli","44-51"]
["D","2022-03-06","Virtus Bolog","86-75","Basket Napol","47-32"]
["D","2022-03-03","Virtus Bolog","98-94","Bursaspor","51-44"]
["D","2022-02-17","Virtus Bolog","93-81","Brindisi","51-42"]
["D","2022-02-01","Virtus Bolog","62-68","Buducnost","30-34"]
[" ","G","M","AS","YS"]
["İlk Yarı",13,7,810,726]
["Maç Sonu",16,3,1607,1453]
[" ","Tarih","EvSahibi","MS","Deplasman","İY"]
["D","2022-06-08","Virtus Bolog","62-66","Olimpia Mila","27-28"]
["D","2022-06-01","Sassari","69-87","Olimpia Mila","34-47"]
["D","2022-05-19","Reggiana","59-89","Olimpia Mila","27-43"]
["D","2022-05-08","Venezia","69-74","Olimpia Mila","41-32"]
["D","2022-05-04","Treviso","80-74","Olimpia Mila","29-32"]
["D","2022-04-28","Anadolu Efes","75-70","Olimpia Mila","42-43"]
["D","2022-04-26","Anadolu Efes","77-65","Olimpia Mila","42-35"]
["D","2022-04-23","Reggiana","63-67","Olimpia Mila","29-39"]
["D","2022-04-10","Virtus Bolog","83-65","Olimpia Mila","46-34"]
["D","2022-04-07","Lyon-Villeur","80-81","Olimpia Mila","41-40"]
["D","2022-04-03","Sassari","92-90","Olimpia Mila","56-43"]
["D","2022-03-24","Anadolu Efes","77-83","Olimpia Mila","51-36"]
["D","2022-03-22","Maccabi Tel","75-58","Olimpia Mila","40-37"]
["D","2022-03-20","Brescia","82-74","Olimpia Mila","41-31"]
["D","2022-03-10","Real Madrid","81-81","Olimpia Mila","41-41"]
["D","2022-03-06","Tortona","64-81","Olimpia Mila","37-40"]
["D","2022-03-04","Panathinaiko","75-76","Olimpia Mila","36-40"]
["D","2022-02-24","Olympiacos","67-58","Olimpia Mila","25-27"]
["D","2022-02-08","Zalgiris Kau","70-74","Olimpia Mila","35-35"]
["D","2022-02-05","Trento","73-79","Olimpia Mila","40-40"]
[" ","G","M","AS","YS"]
["İlk Yarı",9,8,743,760]
["Maç Sonu",11,8,1492,1473]
[" "," "]
["Rekabet Analizi"]
[" ","Tarih","EvSahibi","MS","Deplasman","İY","Lig"]
["Detay","2022-06-08","Virtus Bologna","62-66","Olimpia Milano","27-28","Lega A"]
["Detay","2022-04-10","Virtus Bologna","83-65","Olimpia Milano","46-34","Lega A"]
["Detay","2021-06-11","Virtus Bologna","73-62","Olimpia Milano","41-43","Lega A"]
["Detay","2021-06-09","Virtus Bologna","76-58","Olimpia Milano","37-34","Lega A"]
["Detay","2020-12-27","Virtus Bologna","68-73","Olimpia Milano","38-46","Lega A"]
["Detay","2019-12-29","Virtus Bologna","83-70","Olimpia Milano","46-40","Lega A"]
["Detay","2018-10-14","Virtus Segafredo Bologna","79-88","Olimpia Milano","40-39","Lega A"]
["Detay","2018-03-11","Virtus Segafredo Bologna","67-73","Olimpia Milano","28-40","Lega A"]
["Detay","2016-02-28","Virtus Bologna","85-101","Milano","38-54","Lega A 2015/2016"]
["Detay","2015-05-22","Virtus Bologna","65-92","Milano","38-46","Lega A 2014/2015"]
["Detay","2014-12-29","Virtus Bologna","58-81","Milano","33-46","Lega A 2014/2015"]
[]
["Bahis oynayan tüm bireyler, bulunduğu ülkenin kural ve yasalarından sorumludur"]
[]
["Detay","2018-10-03","Fenerbahce","62-65","Anadolu Efes","30-28","Super Cup"]
["Detay","2018-02-14","Fenerbahce","80-83","Anadolu Efes","36-45","Turkish Cup"]
["Detay","2018-02-04","Fenerbahce","100-74","Anadolu Efes","57-34","Super Ligi"]
["Detay","2017-10-25","Fenerbahce","81-70","Anadolu Efes","34-34","Euroleague"]
["Detay","2017-01-02","Fenerbahce","81-75","Anadolu Efes","41-34","Super Ligi"]
["Detay","2016-11-17","Fenerbahce","88-80","Anadolu Efes","43-42","Euroleague"]
[]
["Bahis oynayan tüm bireyler, bulunduğu ülkenin kural ve yasalarından sorumludur"]

{"sheet":"Betistuta İY","index":2,"n_rows":150,"n_cols":38,"rows_kept":150,"cut":false,"hidden":false,"merged":[[27,29,28,29],[29,29,30,29],[29,28,30,28],[29,27,30,27],[46,16,46,17],[27,27,28,27],[27,28,28,28],[65,16,65,17],[0,12,3,12],[0,13,3,13],[27,25,30,25],[27,26,30,26]]}
[null,null,null,null,null,null,null,null,null,null,null,null,"BAREM",{"$f":"Lozen!C2","v":72.5}]
[]
[]
["Skip Navigation Links"]
[]
["Betistuta"]
["Futbol"]
["Basketbol"]
["Voleybol"]
["Hentbol"]
["BuzHokeyi"]
["Beyzbol"]
["Tenis"]
["BOYZ(F)"]
["BOYZ(B)"]
["Orandelli"]
["Gol Oldu mu ?"]
["Iletisim"]
[" "," "]
[]
["Puerto Rico -BSN"]
[]
[{"$f":"'Betistuta MS'!A23","v":"10.06.2022-21:00"}]
[null," "," "]
[{"$f":"'Betistuta MS'!A25","v":"Virtus Bologna"}]
[]
[{"$f":"'Betistuta MS'!A27","v":"Olimpia Milano"}]
[null,null,null,null,null,null,null,null,null,null,null,null,"SKOR 1",{"$f":"((X53*X51)+(X73*X51))*0.5","v":42.470058293587712},{"$f":"((X72*X70)+(X54*X70))*0.5","v":44.57423708920188},{"$f":"MROUND(SUM(N28,O28),1)","v":87},{"$f":"ABS(N28-O28)","v":2.1041787956141675},{"$f":"T57","v":41.4},{"$f":"T76","v":45},{"$f":"MROUND(SUM(R28,S28),1)","v":86},{"$f":"ABS(R28-S28)","v":3.6000000000000014},"EV",null,"DEP",null,"BAREM",{"$f":"N1","v":72.5},{"$f":"AB48","v":"Virtus Bologna"},{"$f":"AB30+AD30","v":79},{"$f":"AD48","v":"Olimpia Milano"},"ALT","ÜST","MS1","MS2","EV - FORM","DEP - FORM","EV SAYI","DEP SAYI"]
[" ",null,null,null,null,null,null,null,null,null,null,null,"SKOR2",{"$f":"((X53*X51)+(X69*X51))*0.5","v":41.708787491772277},{"$f":"((X72*X70)+(X50*X70))*0.5","v":45.287580888259967},{"$f":"MROUND(SUM(N29,O29),1)","v":87},{"$f":"ABS(N29-O29)","v":3.5787933964876899},{"$f":"N32","v":41.697409378765613},{"$f":"O32","v":42.530459727227836},{"$f":"MROUND(SUM(R29,S29),1)","v":84},{"$f":"ABS(R29-S29)","v":0.8330503484622227},{"$f":"IFERROR(VALUE(LEFT(F136,SEARCH(\"-\",F136,1)-1)),\"\")","v":27},null,{"$f":"IFERROR(VALUE(RIGHT(F136,LEN(F136)-SEARCH(\"-\",F136,SEARCH(\"-\",F136,1)-1))),\"\")","v":28},null,null,null,null,null,null,{"$f":"1-AF29","v":0.20364147941979893},{"$f":"_xlfn.POISSON.DIST(AC28,AA28,TRUE)","v":0.79635852058020107},{"$f":"_xlfn.POISSON.DIST(AB30,AD30+2.5,TRUE)","v":0.44835945748471634},{"$f":"1-AG29","v":0.55164054251528372},{"$f":"COUNTIF(V48:V57,\"W\")/10-2.28%","v":0.57719999999999994},{"$f":"COUNTIF(V67:V76,\"W\")/10-2.28%","v":0.67719999999999991},{"$f":"R31","v":44},{"$f":"S31","v":42}]
[{"$f":"'Betistuta MS'!A30","v":"Beklenen Skor IY/MS"},null,null,null,null,null,null,null,null,null,null,null,"SKOR3",{"$f":"X51*X69","v":40.410791729702474},{"$f":"X50*X70","v":39.293354264782835},80,1.1174374649196395,{"$f":"AVERAGE(R28:R29)","v":41.548704689382802},{"$f":"AVERAGE(S28:S29)","v":43.765229863613918},{"$f":"MROUND(SUM(R30,S30),1)","v":85},{"$f":"ABS(R30-S30)","v":2.2165251742311156},{"$f":"IFERROR(VALUE(LEFT(F137,SEARCH(\"-\",F137,1)-1)),\"\")","v":46},null,{"$f":"IFERROR(VALUE(RIGHT(F137,LEN(F137)-SEARCH(\"-\",F137,SEARCH(\"-\",F137,1)-1))),\"\")","v":34},null,null,null,{"$f":"AB54-1","v":40},{"$f":"U31","v":2},{"$f":"AD54-1","v":39},"ALT - GÜVEN","ÜST - GÜVEN","MİN. SAYI","MAK. SAYI","MİN. FARK","MAK. FARK","EV SON SAYI","DEP SON SAYI"]
[{"$f":"'Betistuta MS'!A31","v":"39-36  / 75-76"},null,null,null,null,null,null,null,null,null,null,null,"SKOR4",{"$f":"(X51+X71)*0.5","v":42.2},{"$f":"(X52+X70)*0.5","v":40.966666666666669},83,1.2333333333333343,{"$f":"MROUND(S30,1)","v":44},{"$f":"MROUND(R30,1)","v":42},{"$f":"MROUND(T30,1)","v":85},{"$f":"ABS(R31-S31)","v":2},41,null,43,null,null,null,null,null,null,{"$f":"1-AF31","v":5.2799999999999958E-2},{"$f":"((COUNTIF(U67:U76,\"UST\"))+(COUNTIF(U48:U57,\"UST\")))/20-5.28%","v":0.94720000000000004},{"$f":"INT(R32+AL54/2)","v":84},{"$f":"INT(T32+AL54)","v":95},{"$f":"AL52","v":1},{"$f":"AL53","v":18},{"$f":"INT(AK29-AL54+(AH31*AI29)/4)","v":49},{"$f":"INT(AL29-AL54+(AH31*AJ29)/4)","v":49}]
[{"$f":"'Betistuta MS'!A32","v":"19-18,20-18,18-22,18-18"},null,null,null,null,null,null,null,null,null,null,null,"ORTALAMA",{"$f":"AVERAGE(N28:N31)","v":41.697409378765613},{"$f":"AVERAGE(O28:O31)","v":42.530459727227836},84.25,2.0084357475887078,{"$f":"MROUND(MIN(T28:T31,P28:P31),1)","v":80},{"$f":"MROUND(MIN(U28:U31,Q28:Q31),1)","v":1},{"$f":"MROUND(MAX(T28:T31,P28:P31),1)","v":87},{"$f":"MROUND(MAX(U28:U31,Q28:Q31),1)","v":4},{"$f":"IFERROR(VALUE(LEFT(D139,SEARCH(\"-\",D139,1)-1)),\"\")","v":76},null,{"$f":"IFERROR(VALUE(RIGHT(D139,LEN(D139)-SEARCH(\"-\",D139,SEARCH(\"-\",D139,1)-1))),\"\")","v":58}]
[" ",null,null,null,null,null,null,null,null,null,null,null,null,null,null,null,null,null,null,null,null,{"$f":"IFERROR(VALUE(LEFT(D140,SEARCH(\"-\",D140,1)-1)),\"\")","v":68},null,{"$f":"IFERROR(VALUE(RIGHT(D140,LEN(D140)-SEARCH(\"-\",D140,SEARCH(\"-\",D140,1)-1))),\"\")","v":73}]
[" ","Takım Gücü  IY/MS"]
["376.6 /601.4","Maç Sonucu"]
["48-40  / 92-85"]
["29-21,19-19,22-23,22-22","Takım Gücü  IY/MS"]
["346.8 /543.8"," "]
[" ","Sonraki Maç"]
["5/25/2022-E-Indios de Mayaguez"]
["BSN",null,"Sonraki Maç"]
["5/27/2022-E-Gigantes de Carolina"]
["BSN"," "]
[" "]
[" "]
[" "," ",null," "," "]
[{"$f":"'Betistuta MS'!A47","v":" "},{"$f":"'Betistuta MS'!B47","v":"Tarih"},{"$f":"'Betistuta MS'!C47","v":"EvSahibi"},{"$f":"'Betistuta MS'!D47","v":"MS"},{"$f":"'Betistuta MS'!E47","v":"Deplasman"},{"$f":"'Betistuta MS'!F47","v":"İY"},null,null,null,null,null,null,"EV","DEP","EVİN ATTIĞI","EVİN YEDİĞİ","EV SKOR",null,null,null,null,null,"EV'İN TOPLAM ATTIĞI",{"$f":"Q63","v":637},null,{"$f":"A134","v":"Rekabet Analizi"},"TARİH","EV SAHİBİ","MS","DEPLASMAN","İY","LİG","EV","DEP","TOPLAM","ALT / ÜST","MAÇ SONUCU","HANDİKAP"]
[{"$f":"'Betistuta MS'!A48","v":"D"},{"$f":"'Betistuta MS'!B48","v":44720},{"$f":"'Betistuta MS'!C48","v":"Virtus Bolog"},{"$f":"'Betistuta MS'!D48","v":"62-66"},{"$f":"'Betistuta MS'!E48","v":"Olimpia Mila"},{"$f":"'Betistuta MS'!F48","v":"27-28"},null,null,null,null,null,null,{"$f":"IFERROR(VALUE(LEFT(F48,SEARCH(\"-\",F48,1)-1)),\"\")","v":27},{"$f":"IFERROR(VALUE(RIGHT(F48,LEN(F48)-SEARCH(\"-\",F48,SEARCH(\"-\",F48,1)-1))),\"\")","v":28},{"$f":"IF(OR(M48=\"\",N48=\"\"),\"\",IF(C48=$C$86,M48,N48))","v":27},{"$f":"IF(OR(M48=\"\",N48=\"\"),\"\",IF(C48=$C$86,N48,M48))","v":28},{"$f":"O48","v":27},{"$f":"P48","v":28},{"$f":"AVERAGE(Q48:Q57)+3.5","v":41.4},{"$f":"IF(Q48>R48,S48+1,S48-1.5)","v":39.9},{"$f":"IF(AND(Q48+R48>$K$10),\"UST\",\"ALT\")","v":"UST"},{"$f":"IF(Q48>R48,\"W\",\"\")","v":""},"EV'İN TOPLAM YEDİĞİ",{"$f":"R63","v":568},null,null,{"$f":"B136","v":"2022-06-08"},{"$f":"C136","v":"Virtus Bologna"},"62-66","Olimpia Milano","27-28","BSN",{"$f":"V29","v":27},{"$f":"X29","v":28},{"$f":"AG48+AH48","v":55},{"$f":"IF(AI48=\"\",\"\",IF(AI48>$AA$28,\"UST\",\"ALT\"))","v":"ALT"},{"$f":"IF(AG48>AH48,\"MS1\",IF(AH48>AG48,\"MS2\",\"\"))","v":"MS2"},{"$f":"IFERROR(ABS(AG48-AH48),\"\")","v":1}]
[{"$f":"'Betistuta MS'!A49","v":"D"},{"$f":"'Betistuta MS'!B49","v":44712},{"$f":"'Betistuta MS'!C49","v":"Tortona"},{"$f":"'Betistuta MS'!D49","v":"69-77"},{"$f":"'Betistuta MS'!E49","v":"Virtus Bolog"},{"$f":"'Betistuta MS'!F49","v":"33-47"},null,null,null,null,null,null,{"$f":"IFERROR(VALUE(LEFT(F49,SEARCH(\"-\",F49,1)-1)),\"\")","v":33},{"$f":"IFERROR(VALUE(RIGHT(F49,LEN(F49)-SEARCH(\"-\",F49,SEARCH(\"-\",F49,1)-1))),\"\")","v":47},{"$f":"IF(OR(M49=\"\",N49=\"\"),\"\",IF(C49=$C$86,M49,N49))","v":47},{"$f":"IF(OR(M49=\"\",N49=\"\"),\"\",IF(C49=$C$86,N49,M49))","v":33},{"$f":"O49","v":47},33,null,{"$f":"IF(Q49>R49,T48+1,T48-1.5)","v":40.9},"UST",{"$f":"IF(Q49>R49,\"W\",\"\")","v":"W"},"EV ATTIĞI / EV YEDİĞİ",{"$f":"X47/X48","v":1.1214788732394365},null,null,{"$f":"B137","v":"2022-04-10"},"Virtus Bologna","83-65","Olimpia Milano","46-34","BSN",{"$f":"V30","v":46},{"$f":"X30","v":34},{"$f":"AG49+AH49","v":80},{"$f":"IF(AI49=\"\",\"\",IF(AI49>$AA$28,\"UST\",\"ALT\"))","v":"UST"},{"$f":"IF(AG49>AH49,\"MS1\",IF(AH49>AG49,\"MS2\",\"\"))","v":"MS1"},{"$f":"IFERROR(ABS(AG49-AH49),\"\")","v":12}]
[{"$f":"'Betistuta MS'!A50","v":"D"},{"$f":"'Betistuta MS'!B50","v":44710},{"$f":"'Betistuta MS'!C50","v":"Virtus Bolog"},{"$f":"'Betistuta MS'!D50","v":"91-70"},{"$f":"'Betistuta MS'!E50","v":"Tortona"},{"$f":"'Betistuta MS'!F50","v":"41-35"},null,null,null,null,null,null,41,35,41,35,41,35,null,{"$f":"IF(Q50>R50,T49+1,T49-1.5)","v":41.9},"UST",{"$f":"IF(Q50>R50,\"W\",\"\")","v":"W"},"EV YEDİĞİ / EV ATTIĞI",{"$f":"X48/X47","v":0.89167974882260592},null,null,"2021-06-11","Virtus Bologna","73-62","Olimpia Milano","41-43","BSN",41,43,84,{"$f":"IF(AI50=\"\",\"\",IF(AI50>$AA$28,\"UST\",\"ALT\"))","v":"UST"},"MS2",2]
[{"$f":"'Betistuta MS'!A51","v":"D"},{"$f":"'Betistuta MS'!B51","v":44708},{"$f":"'Betistuta MS'!C51","v":"Virtus Bolog"},{"$f":"'Betistuta MS'!D51","v":"77-73"},{"$f":"'Betistuta MS'!E51","v":"Tortona"},{"$f":"'Betistuta MS'!F51","v":"35-38"},null,null,null,null,null,null,35,38,35,38,35,38,null,{"$f":"IF(Q51>R51,T50+1,T50-1.5)","v":40.4},"UST","","EV'İN ORT. ATTIĞI",{"$f":"AVERAGE(Q48:Q62)","v":42.466666666666669},null,null,"2021-06-09","Virtus Bologna","76-58","Olimpia Milano","37-34","BSN",76,58,{"$f":"AG51+AH51","v":134},{"$f":"IF(AI51=\"\",\"\",IF(AI51>$AA$28,\"UST\",\"ALT\"))","v":"UST"},"MS1",18]
[{"$f":"'Betistuta MS'!A52","v":"D"},{"$f":"'Betistuta MS'!B52","v":44700},{"$f":"'Betistuta MS'!C52","v":"Pesaro"},{"$f":"'Betistuta MS'!D52","v":"55-75"},{"$f":"'Betistuta MS'!E52","v":"Virtus Bolog"},{"$f":"'Betistuta MS'!F52","v":"35-35"},null,null,null,null,null,null,35,35,35,35,35,35,null,38.9,"UST","","EV'İN ORT. YEDİĞİ",{"$f":"AVERAGE(R48:R62)","v":37.866666666666667},null,null,null,null,null,null,null,null,null,"MIN",{"$f":"MIN(AI48:AI51)","v":55},null,null,{"$f":"MIN(AL48:AL51)","v":1}]
[{"$f":"'Betistuta MS'!A53","v":"D"},{"$f":"'Betistuta MS'!B53","v":44698},{"$f":"'Betistuta MS'!C53","v":"Virtus Bolog"},{"$f":"'Betistuta MS'!D53","v":"70-51"},{"$f":"'Betistuta MS'!E53","v":"Pesaro"},{"$f":"'Betistuta MS'!F53","v":"31-25"},null,null,null,null,null,null,31,25,31,25,31,25,null,39.9,"UST","W","EV'İN TOPLAM ATTIĞI / DEP'İN TOPLAM YEDİĞİ",{"$f":"X47/X67","v":1.0127186009538951},null,null,null,null,null,null,null,null,null,"MAX",{"$f":"MAX(AI48:AI51)","v":134},null,null,{"$f":"MAX(AL48:AL51)","v":18}]
[{"$f":"'Betistuta MS'!A54","v":"D"},{"$f":"'Betistuta MS'!B54","v":44696},{"$f":"'Betistuta MS'!C54","v":"Virtus Bolog"},{"$f":"'Betistuta MS'!D54","v":"82-76"},{"$f":"'Betistuta MS'!E54","v":"Pesaro"},{"$f":"'Betistuta MS'!F54","v":"45-36"},null,null,null,null,null,null,45,36,45,36,45,36,null,40.9,"UST","W","EV'İN TOPLAM YEDİĞİ / DEP'İN TOPLAM ATTIĞI",{"$f":"X48/X66","v":0.85930408472012099},null,null,null,{"$f":"INT((AK29+AK31)/2-AL54/2)-1","v":41},null,{"$f":"INT((AL29+AL31)/2-AL54/2)-1","v":40},null,null,null,"ORT.",{"$f":"AVERAGE(AI48:AI51)","v":88.25},null,null,{"$f":"AVERAGE(AL48:AL51)","v":8.25}]
[{"$f":"'Betistuta MS'!A55","v":"D"},{"$f":"'Betistuta MS'!B55","v":44692},{"$f":"'Betistuta MS'!C55","v":"Virtus Bolog"},{"$f":"'Betistuta MS'!D55","v":"80-67"},{"$f":"'Betistuta MS'!E55","v":"Bursaspor"},{"$f":"'Betistuta MS'!F55","v":"41-31"},null,null,null,null,null,null,41,31,41,31,41,31,null,41.9,"UST","W"]
[{"$f":"'Betistuta MS'!A56","v":"D"},{"$f":"'Betistuta MS'!B56","v":44689},{"$f":"'Betistuta MS'!C56","v":"Virtus Bolog"},{"$f":"'Betistuta MS'!D56","v":"79-57"},{"$f":"'Betistuta MS'!E56","v":"Brescia"},{"$f":"'Betistuta MS'!F56","v":"42-24"},null,null,null,null,null,null,42,24,42,24,42,24,null,42.9,"UST","W"]
[{"$f":"'Betistuta MS'!A57","v":"D"},{"$f":"'Betistuta MS'!B57","v":44687},{"$f":"'Betistuta MS'!C57","v":"Sassari"},{"$f":"'Betistuta MS'!D57","v":"108-73"},{"$f":"'Betistuta MS'!E57","v":"Virtus Bolog"},{"$f":"'Betistuta MS'!F57","v":"47-35"},null,null,null,null,null,null,47,35,35,47,35,47,null,{"$f":"IF(Q57>R57,T56+1,T56-1.5)","v":41.4},"UST",""]
[{"$f":"'Betistuta MS'!A58","v":"D"},{"$f":"'Betistuta MS'!B58","v":44685},{"$f":"'Betistuta MS'!C58","v":"Valencia"},{"$f":"'Betistuta MS'!D58","v":"73-83"},{"$f":"'Betistuta MS'!E58","v":"Virtus Bolog"},{"$f":"'Betistuta MS'!F58","v":"38-50"},null,null,null,null,null,null,38,50,50,38,{"$f":"V29","v":27},{"$f":"X29","v":28}]
[{"$f":"'Betistuta MS'!A59","v":"D"},{"$f":"'Betistuta MS'!B59","v":44680},{"$f":"'Betistuta MS'!C59","v":"Treviso"},{"$f":"'Betistuta MS'!D59","v":"76-113"},{"$f":"'Betistuta MS'!E59","v":"Virtus Bolog"},{"$f":"'Betistuta MS'!F59","v":"34-52"},null,null,null,null,null,null,34,52,52,34,{"$f":"V30","v":46},{"$f":"X30","v":34}]
[{"$f":"'Betistuta MS'!A60","v":"D"},{"$f":"'Betistuta MS'!B60","v":44677},{"$f":"'Betistuta MS'!C60","v":"Virtus Bolog"},{"$f":"'Betistuta MS'!D60","v":"83-77"},{"$f":"'Betistuta MS'!E60","v":"Ulm"},{"$f":"'Betistuta MS'!F60","v":"43-45"},null,null,null,null,null,null,43,45,43,45,{"$f":"V31","v":41},{"$f":"X31","v":43}]
[{"$f":"'Betistuta MS'!A61","v":"D"},{"$f":"'Betistuta MS'!B61","v":44673},{"$f":"'Betistuta MS'!C61","v":"Virtus Bolog"},{"$f":"'Betistuta MS'!D61","v":"101-83"},{"$f":"'Betistuta MS'!E61","v":"Tortona"},{"$f":"'Betistuta MS'!F61","v":"49-53"},null,null,null,null,null,null,49,53,49,53,{"$f":"V32","v":76},{"$f":"X32","v":58}]
[{"$f":"'Betistuta MS'!A62","v":"D"},{"$f":"'Betistuta MS'!B62","v":44671},{"$f":"'Betistuta MS'!C62","v":"Virtus Bolog"},{"$f":"'Betistuta MS'!D62","v":"75-67"},{"$f":"'Betistuta MS'!E62","v":"Lietkabelis"},{"$f":"'Betistuta MS'!F62","v":"39-34"},null,null,null,null,null,null,39,34,39,34,{"$f":"V33","v":68},{"$f":"X33","v":73}]
[{"$f":"'Betistuta MS'!A63","v":" "},{"$f":"'Betistuta MS'!B63","v":"G"},{"$f":"'Betistuta MS'!C63","v":"M"},{"$f":"'Betistuta MS'!D63","v":"AS"},{"$f":"'Betistuta MS'!E63","v":"YS"},null,null,null,null,null,null,null,{"$f":"SUM(M48:M62)","v":580},{"$f":"SUM(N48:N62)","v":568},{"$f":"SUM(O48:O62)","v":612},{"$f":"SUM(P48:P62)","v":536},{"$f":"SUM(Q48:Q62)","v":637},{"$f":"SUM(R48:R62)","v":568},41.4,408.99999999999994]
[{"$f":"'Betistuta MS'!A64","v":"İlk Yarı"},{"$f":"'Betistuta MS'!B64","v":9},{"$f":"'Betistuta MS'!C64","v":5},{"$f":"'Betistuta MS'!D64","v":612},{"$f":"'Betistuta MS'!E64","v":536}]
[{"$f":"'Betistuta MS'!A65","v":"Maç Sonu"},{"$f":"'Betistuta MS'!B65","v":13},{"$f":"'Betistuta MS'!C65","v":2},{"$f":"'Betistuta MS'!D65","v":1221},{"$f":"'Betistuta MS'!E65","v":1068}]
[" ","Tarih","EvSahibi","MS","Deplasman","İY",null,null,null,null,null,null,"EV","DEP","DEP'İN ATTIĞI","DEP'İN YEDİĞİ","DEP SKOR",null,null,null,null,null,"DEP'İN TOPLAM ATTIĞI",{"$f":"Q82","v":661}]
[{"$f":"'Betistuta MS'!A67","v":"D"},{"$f":"'Betistuta MS'!B67","v":44720},{"$f":"'Betistuta MS'!C67","v":"Virtus Bolog"},{"$f":"'Betistuta MS'!D67","v":"62-66"},{"$f":"'Betistuta MS'!E67","v":"Olimpia Mila"},{"$f":"'Betistuta MS'!F67","v":"27-28"},null,null,null,null,null,null,{"$f":"IFERROR(VALUE(LEFT(F67,SEARCH(\"-\",F67,1)-1)),\"\")","v":27},{"$f":"IFERROR(VALUE(RIGHT(F67,LEN(F67)-SEARCH(\"-\",F67,SEARCH(\"-\",F67,1)-1))),\"\")","v":28},{"$f":"IF(OR(M67=\"\",N67=\"\"),\"\",IF(C67=$E$110,M67,N67))","v":28},{"$f":"IF(OR(M67=\"\",N67=\"\"),\"\",IF(C67=$E$110,N67,M67))","v":27},{"$f":"O67","v":28},27,{"$f":"AVERAGE(Q67:Q76)","v":42.5},{"$f":"IF(Q67>R67,S67+1,S67-1.5)","v":43.5},{"$f":"IF(AND(Q67+R67>$K$10),\"UST\",\"ALT\")","v":"UST"},{"$f":"IF(Q67>R67,\"W\",\"\")","v":"W"},"DEP'İN TOPLAM YEDİĞİ",{"$f":"R82","v":629}]
[{"$f":"'Betistuta MS'!A68","v":"D"},{"$f":"'Betistuta MS'!B68","v":44713},{"$f":"'Betistuta MS'!C68","v":"Sassari"},{"$f":"'Betistuta MS'!D68","v":"69-87"},{"$f":"'Betistuta MS'!E68","v":"Olimpia Mila"},{"$f":"'Betistuta MS'!F68","v":"34-47"},null,null,null,null,null,null,{"$f":"IFERROR(VALUE(LEFT(F68,SEARCH(\"-\",F68,1)-1)),\"\")","v":34},{"$f":"IFERROR(VALUE(RIGHT(F68,LEN(F68)-SEARCH(\"-\",F68,SEARCH(\"-\",F68,1)-1))),\"\")","v":47},{"$f":"IF(OR(M68=\"\",N68=\"\"),\"\",IF(C68=$E$110,M68,N68))","v":47},{"$f":"IF(OR(M68=\"\",N68=\"\"),\"\",IF(C68=$E$110,N68,M68))","v":34},47,34,null,{"$f":"IF(Q68>R68,T67+1,T67-1.5)","v":44.5},"UST","W","DEP ATTIĞI / DEP YEDİĞİ",{"$f":"X66/X67","v":1.0508744038155804}]
[{"$f":"'Betistuta MS'!A69","v":"D"},{"$f":"'Betistuta MS'!B69","v":44711},{"$f":"'Betistuta MS'!C69","v":"Olimpia Mila"},{"$f":"'Betistuta MS'!D69","v":"91-82"},{"$f":"'Betistuta MS'!E69","v":"Sassari"},{"$f":"'Betistuta MS'!F69","v":"41-49"},null,null,null,null,null,null,41,49,41,49,41,49,null,{"$f":"IF(Q69>R69,T68+1,T68-1.5)","v":43},"UST","","DEP YEDİĞİ / DEP ATTIĞI",{"$f":"X67/X66","v":0.95158850226928893}]
[{"$f":"'Betistuta MS'!A70","v":"D"},{"$f":"'Betistuta MS'!B70","v":44709},{"$f":"'Betistuta MS'!C70","v":"Olimpia Mila"},{"$f":"'Betistuta MS'!D70","v":"88-71"},{"$f":"'Betistuta MS'!E70","v":"Sassari"},{"$f":"'Betistuta MS'!F70","v":"50-42"},null,null,null,null,null,null,50,42,50,42,50,42,null,{"$f":"IF(Q70>R70,T69+1,T69-1.5)","v":44},"UST","W","DEP'İN ORT. ATTIĞI",{"$f":"AVERAGE(Q67:Q81)","v":44.06666666666667}]
[{"$f":"'Betistuta MS'!A71","v":"D"},{"$f":"'Betistuta MS'!B71","v":44700},{"$f":"'Betistuta MS'!C71","v":"Reggiana"},{"$f":"'Betistuta MS'!D71","v":"59-89"},{"$f":"'Betistuta MS'!E71","v":"Olimpia Mila"},{"$f":"'Betistuta MS'!F71","v":"27-43"},null,null,null,null,null,null,27,43,43,27,43,27,null,45,"UST","W","DEP'İN ORT. YEDİĞİ",{"$f":"AVERAGE(R67:R81)","v":41.93333333333333}]
[{"$f":"'Betistuta MS'!A72","v":"D"},{"$f":"'Betistuta MS'!B72","v":44698},{"$f":"'Betistuta MS'!C72","v":"Olimpia Mila"},{"$f":"'Betistuta MS'!D72","v":"91-65"},{"$f":"'Betistuta MS'!E72","v":"Reggiana"},{"$f":"'Betistuta MS'!F72","v":"57-32"},null,null,null,null,null,null,57,32,57,32,57,32,null,46,"UST","W","DEP'İN TOPLAM ATTIĞI / EV'İN TOPLAM YEDİĞİ",{"$f":"X66/X48","v":1.1637323943661972}]
[{"$f":"'Betistuta MS'!A73","v":"D"},{"$f":"'Betistuta MS'!B73","v":44696},{"$f":"'Betistuta MS'!C73","v":"Olimpia Mila"},{"$f":"'Betistuta MS'!D73","v":"91-82"},{"$f":"'Betistuta MS'!E73","v":"Reggiana"},{"$f":"'Betistuta MS'!F73","v":"51-40"},null,null,null,null,null,null,51,40,51,40,51,40,null,47,"UST","W","DEP'İN TOPLAM YEDİĞİ / EV'İN TOPLAM ATTIĞI",{"$f":"X67/X47","v":0.98744113029827318}]
[{"$f":"'Betistuta MS'!A74","v":"D"},{"$f":"'Betistuta MS'!B74","v":44689},{"$f":"'Betistuta MS'!C74","v":"Venezia"},{"$f":"'Betistuta MS'!D74","v":"69-74"},{"$f":"'Betistuta MS'!E74","v":"Olimpia Mila"},{"$f":"'Betistuta MS'!F74","v":"41-32"},null,null,null,null,null,null,41,32,32,41,32,41,null,45.5,"UST",""]
[{"$f":"'Betistuta MS'!A75","v":"D"},{"$f":"'Betistuta MS'!B75","v":44685},{"$f":"'Betistuta MS'!C75","v":"Treviso"},{"$f":"'Betistuta MS'!D75","v":"80-74"},{"$f":"'Betistuta MS'!E75","v":"Olimpia Mila"},{"$f":"'Betistuta MS'!F75","v":"29-32"},null,null,null,null,null,null,29,32,32,29,32,29,null,46.5,"UST","W"]
[{"$f":"'Betistuta MS'!A76","v":"D"},{"$f":"'Betistuta MS'!B76","v":44682},{"$f":"'Betistuta MS'!C76","v":"Olimpia Mila"},{"$f":"'Betistuta MS'!D76","v":"92-87"},{"$f":"'Betistuta MS'!E76","v":"Brindisi"},{"$f":"'Betistuta MS'!F76","v":"44-50"},null,null,null,null,null,null,44,50,44,50,44,50,null,{"$f":"IF(Q76>R76,T75+1,T75-1.5)","v":45},"UST",""]
[{"$f":"'Betistuta MS'!A77","v":"D"},{"$f":"'Betistuta MS'!B77","v":44679},{"$f":"'Betistuta MS'!C77","v":"Anadolu Efes"},{"$f":"'Betistuta MS'!D77","v":"75-70"},{"$f":"'Betistuta MS'!E77","v":"Olimpia Mila"},{"$f":"'Betistuta MS'!F77","v":"42-43"},null,null,null,null,null,null,42,43,43,42,{"$f":"X29","v":28},{"$f":"V29","v":27}]
[{"$f":"'Betistuta MS'!A78","v":"D"},{"$f":"'Betistuta MS'!B78","v":44677},{"$f":"'Betistuta MS'!C78","v":"Anadolu Efes"},{"$f":"'Betistuta MS'!D78","v":"77-65"},{"$f":"'Betistuta MS'!E78","v":"Olimpia Mila"},{"$f":"'Betistuta MS'!F78","v":"42-35"},null,null,null,null,null,null,42,35,35,42,{"$f":"X30","v":34},{"$f":"V30","v":46}]
[{"$f":"'Betistuta MS'!A79","v":"D"},{"$f":"'Betistuta MS'!B79","v":44674},{"$f":"'Betistuta MS'!C79","v":"Reggiana"},{"$f":"'Betistuta MS'!D79","v":"63-67"},{"$f":"'Betistuta MS'!E79","v":"Olimpia Mila"},{"$f":"'Betistuta MS'!F79","v":"29-39"},null,null,null,null,null,null,29,39,39,29,{"$f":"X31","v":43},{"$f":"V31","v":41}]
[{"$f":"'Betistuta MS'!A80","v":"D"},{"$f":"'Betistuta MS'!B80","v":44672},{"$f":"'Betistuta MS'!C80","v":"Olimpia Mila"},{"$f":"'Betistuta MS'!D80","v":"73-66"},{"$f":"'Betistuta MS'!E80","v":"Anadolu Efes"},{"$f":"'Betistuta MS'!F80","v":"33-33"},null,null,null,null,null,null,33,33,33,33,{"$f":"X32","v":58},{"$f":"V32","v":76}]
[{"$f":"'Betistuta MS'!A81","v":"D"},{"$f":"'Betistuta MS'!B81","v":44670},{"$f":"'Betistuta MS'!C81","v":"Olimpia Mila"},{"$f":"'Betistuta MS'!D81","v":"48-64"},{"$f":"'Betistuta MS'!E81","v":"Anadolu Efes"},{"$f":"'Betistuta MS'!F81","v":"26-29"},null,null,null,null,null,null,26,29,26,29,{"$f":"X33","v":73},{"$f":"V33","v":68}]
[{"$f":"'Betistuta MS'!A82","v":" "},{"$f":"'Betistuta MS'!B82","v":"G"},{"$f":"'Betistuta MS'!C82","v":"M"},{"$f":"'Betistuta MS'!D82","v":"AS"},{"$f":"'Betistuta MS'!E82","v":"YS"},null,null,null,null,null,null,null,{"$f":"SUM(M67:M81)","v":573},{"$f":"SUM(N67:N81)","v":574},{"$f":"SUM(O67:O81)","v":601},{"$f":"SUM(P67:P81)","v":546},{"$f":"SUM(Q67:Q81)","v":661},{"$f":"SUM(R67:R81)","v":629},42.5,450]
[{"$f":"'Betistuta MS'!A83","v":"İlk Yarı"},{"$f":"'Betistuta MS'!B83","v":9},{"$f":"'Betistuta MS'!C83","v":5},{"$f":"'Betistuta MS'!D83","v":601},{"$f":"'Betistuta MS'!E83","v":546}]
[{"$f":"'Betistuta MS'!A84","v":"Maç Sonu"},{"$f":"'Betistuta MS'!B84","v":11},{"$f":"'Betistuta MS'!C84","v":4},{"$f":"'Betistuta MS'!D84","v":1166},{"$f":"'Betistuta MS'!E84","v":1071}]
[" ","Tarih","EvSahibi","MS","Deplasman","İY"]
[{"$f":"'Betistuta MS'!A86","v":"D"},{"$f":"'Betistuta MS'!B86","v":"2022-06-08"},{"$f":"'Betistuta MS'!C86","v":"Virtus Bolog"},{"$f":"'Betistuta MS'!D86","v":"62-66"},{"$f":"'Betistuta MS'!E86","v":"Olimpia Mila"},{"$f":"'Betistuta MS'!F86","v":"27-28"}]
[{"$f":"'Betistuta MS'!A87","v":"D"},{"$f":"'Betistuta MS'!B87","v":"2022-05-29"},{"$f":"'Betistuta MS'!C87","v":"Virtus Bolog"},{"$f":"'Betistuta MS'!D87","v":"91-70"},{"$f":"'Betistuta MS'!E87","v":"Tortona"},{"$f":"'Betistuta MS'!F87","v":"41-35"}]
[{"$f":"'Betistuta MS'!A88","v":"D"},{"$f":"'Betistuta MS'!B88","v":"2022-05-27"},{"$f":"'Betistuta MS'!C88","v":"Virtus Bolog"},{"$f":"'Betistuta MS'!D88","v":"77-73"},{"$f":"'Betistuta MS'!E88","v":"Tortona"},{"$f":"'Betistuta MS'!F88","v":"35-38"}]
[{"$f":"'Betistuta MS'!A89","v":"D"},{"$f":"'Betistuta MS'!B89","v":"2022-05-17"},{"$f":"'Betistuta MS'!C89","v":"Virtus Bolog"},{"$f":"'Betistuta MS'!D89","v":"70-51"},{"$f":"'Betistuta MS'!E89","v":"Pesaro"},{"$f":"'Betistuta MS'!F89","v":"31-25"}]
[{"$f":"'Betistuta MS'!A90","v":"D"},{"$f":"'Betistuta MS'!B90","v":"2022-05-15"},{"$f":"'Betistuta MS'!C90","v":"Virtus Bolog"},{"$f":"'Betistuta MS'!D90","v":"82-76"},{"$f":"'Betistuta MS'!E90","v":"Pesaro"},{"$f":"'Betistuta MS'!F90","v":"45-36"}]
[{"$f":"'Betistuta MS'!A91","v":"D"},{"$f":"'Betistuta MS'!B91","v":"2022-05-11"},{"$f":"'Betistuta MS'!C91","v":"Virtus Bolog"},{"$f":"'Betistuta MS'!D91","v":"80-67"},{"$f":"'Betistuta MS'!E91","v":"Bursaspor"},{"$f":"'Betistuta MS'!F91","v":"41-31"}]
[{"$f":"'Betistuta MS'!A92","v":"D"},{"$f":"'Betistuta MS'!B92","v":"2022-05-08"},{"$f":"'Betistuta MS'!C92","v":"Virtus Bolog"},{"$f":"'Betistuta MS'!D92","v":"79-57"},{"$f":"'Betistuta MS'!E92","v":"Brescia"},{"$f":"'Betistuta MS'!F92","v":"42-24"}]
[{"$f":"'Betistuta MS'!A93","v":"D"},{"$f":"'Betistuta MS'!B93","v":"2022-04-26"},{"$f":"'Betistuta MS'!C93","v":"Virtus Bolog"},{"$f":"'Betistuta MS'!D93","v":"83-77"},{"$f":"'Betistuta MS'!E93","v":"Ulm"},{"$f":"'Betistuta MS'!F93","v":"43-45"}]
[{"$f":"'Betistuta MS'!A94","v":"D"},{"$f":"'Betistuta MS'!B94","v":"2022-04-22"},{"$f":"'Betistuta MS'!C94","v":"Virtus Bolog"},{"$f":"'Betistuta MS'!D94","v":"101-83"},{"$f":"'Betistuta MS'!E94","v":"Tortona"},{"$f":"'Betistuta MS'!F94","v":"49-53"}]
[{"$f":"'Betistuta MS'!A95","v":"D"},{"$f":"'Betistuta MS'!B95","v":"2022-04-20"},{"$f":"'Betistuta MS'!C95","v":"Virtus Bolog"},{"$f":"'Betistuta MS'!D95","v":"75-67"},{"$f":"'Betistuta MS'!E95","v":"Lietkabelis"},{"$f":"'Betistuta MS'!F95","v":"39-34"}]
[{"$f":"'Betistuta MS'!A96","v":"D"},{"$f":"'Betistuta MS'!B96","v":"2022-04-13"},{"$f":"'Betistuta MS'!C96","v":"Virtus Bolog"},{"$f":"'Betistuta MS'!D96","v":"82-82"},{"$f":"'Betistuta MS'!E96","v":"Trento"},{"$f":"'Betistuta MS'!F96","v":"47-35"}]
[{"$f":"'Betistuta MS'!A97","v":"D"},{"$f":"'Betistuta MS'!B97","v":"2022-04-10"},{"$f":"'Betistuta MS'!C97","v":"Virtus Bolog"},{"$f":"'Betistuta MS'!D97","v":"83-65"},{"$f":"'Betistuta MS'!E97","v":"Olimpia Mila"},{"$f":"'Betistuta MS'!F97","v":"46-34"}]
[{"$f":"'Betistuta MS'!A98","v":"D"},{"$f":"'Betistuta MS'!B98","v":"2022-03-29"},{"$f":"'Betistuta MS'!C98","v":"Virtus Bolog"},{"$f":"'Betistuta MS'!D98","v":"70-68"},{"$f":"'Betistuta MS'!E98","v":"Gran Canaria"},{"$f":"'Betistuta MS'!F98","v":"36-35"}]
[{"$f":"'Betistuta MS'!A99","v":"D"},{"$f":"'Betistuta MS'!B99","v":"2022-03-26"},{"$f":"'Betistuta MS'!C99","v":"Virtus Bolog"},{"$f":"'Betistuta MS'!D99","v":"78-70"},{"$f":"'Betistuta MS'!E99","v":"Reggiana"},{"$f":"'Betistuta MS'!F99","v":"34-26"}]
[{"$f":"'Betistuta MS'!A100","v":"D"},{"$f":"'Betistuta MS'!B100","v":"2022-03-20"},{"$f":"'Betistuta MS'!C100","v":"Virtus Bolog"},{"$f":"'Betistuta MS'!D100","v":"81-77"},{"$f":"'Betistuta MS'!E100","v":"Venezia"},{"$f":"'Betistuta MS'!F100","v":"31-44"}]
[{"$f":"'Betistuta MS'!A101","v":"D"},{"$f":"'Betistuta MS'!B101","v":"2022-03-16"},{"$f":"'Betistuta MS'!C101","v":"Virtus Bolog"},{"$f":"'Betistuta MS'!D101","v":"74-86"},{"$f":"'Betistuta MS'!E101","v":"Cedevita Oli"},{"$f":"'Betistuta MS'!F101","v":"44-51"}]
[{"$f":"'Betistuta MS'!A102","v":"D"},{"$f":"'Betistuta MS'!B102","v":"2022-03-06"},{"$f":"'Betistuta MS'!C102","v":"Virtus Bolog"},{"$f":"'Betistuta MS'!D102","v":"86-75"},{"$f":"'Betistuta MS'!E102","v":"Basket Napol"},{"$f":"'Betistuta MS'!F102","v":"47-32"}]
[{"$f":"'Betistuta MS'!A103","v":"D"},{"$f":"'Betistuta MS'!B103","v":"2022-03-03"},{"$f":"'Betistuta MS'!C103","v":"Virtus Bolog"},{"$f":"'Betistuta MS'!D103","v":"98-94"},{"$f":"'Betistuta MS'!E103","v":"Bursaspor"},{"$f":"'Betistuta MS'!F103","v":"51-44"}]
[{"$f":"'Betistuta MS'!A104","v":"D"},{"$f":"'Betistuta MS'!B104","v":"2022-02-17"},{"$f":"'Betistuta MS'!C104","v":"Virtus Bolog"},{"$f":"'Betistuta MS'!D104","v":"93-81"},{"$f":"'Betistuta MS'!E104","v":"Brindisi"},{"$f":"'Betistuta MS'!F104","v":"51-42"}]
[{"$f":"'Betistuta MS'!A105","v":"D"},{"$f":"'Betistuta MS'!B105","v":"2022-02-01"},{"$f":"'Betistuta MS'!C105","v":"Virtus Bolog"},{"$f":"'Betistuta MS'!D105","v":"62-68"},{"$f":"'Betistuta MS'!E105","v":"Buducnost"},{"$f":"'Betistuta MS'!F105","v":"30-34"}]
[" ","G","M","AS","YS"]
["İlk Yarı",{"$f":"'Betistuta MS'!B107","v":13},{"$f":"'Betistuta MS'!C107","v":7},{"$f":"'Betistuta MS'!D107","v":810},{"$f":"'Betistuta MS'!E107","v":726}]
["Maç Sonu",{"$f":"'Betistuta MS'!B108","v":16},{"$f":"'Betistuta MS'!C108","v":3},{"$f":"'Betistuta MS'!D108","v":1607},{"$f":"'Betistuta MS'!E108","v":1453}]
[" ","Tarih","EvSahibi","MS","Deplasman","İY"]
[{"$f":"'Betistuta MS'!A110","v":"D"},{"$f":"'Betistuta MS'!B110","v":"2022-06-08"},{"$f":"'Betistuta MS'!C110","v":"Virtus Bolog"},{"$f":"'Betistuta MS'!D110","v":"62-66"},{"$f":"'Betistuta MS'!E110","v":"Olimpia Mila"},{"$f":"'Betistuta MS'!F110","v":"27-28"}]
[{"$f":"'Betistuta MS'!A111","v":"D"},{"$f":"'Betistuta MS'!B111","v":"2022-06-01"},{"$f":"'Betistuta MS'!C111","v":"Sassari"},{"$f":"'Betistuta MS'!D111","v":"69-87"},{"$f":"'Betistuta MS'!E111","v":"Olimpia Mila"},{"$f":"'Betistuta MS'!F111","v":"34-47"}]
[{"$f":"'Betistuta MS'!A112","v":"D"},{"$f":"'Betistuta MS'!B112","v":"2022-05-19"},{"$f":"'Betistuta MS'!C112","v":"Reggiana"},{"$f":"'Betistuta MS'!D112","v":"59-89"},{"$f":"'Betistuta MS'!E112","v":"Olimpia Mila"},{"$f":"'Betistuta MS'!F112","v":"27-43"}]
[{"$f":"'Betistuta MS'!A113","v":"D"},{"$f":"'Betistuta MS'!B113","v":"2022-05-08"},{"$f":"'Betistuta MS'!C113","v":"Venezia"},{"$f":"'Betistuta MS'!D113","v":"69-74"},{"$f":"'Betistuta MS'!E113","v":"Olimpia Mila"},{"$f":"'Betistuta MS'!F113","v":"41-32"}]
[{"$f":"'Betistuta MS'!A114","v":"D"},{"$f":"'Betistuta MS'!B114","v":"2022-05-04"},{"$f":"'Betistuta MS'!C114","v":"Treviso"},{"$f":"'Betistuta MS'!D114","v":"80-74"},{"$f":"'Betistuta MS'!E114","v":"Olimpia Mila"},{"$f":"'Betistuta MS'!F114","v":"29-32"}]
[{"$f":"'Betistuta MS'!A115","v":"D"},{"$f":"'Betistuta MS'!B115","v":"2022-04-28"},{"$f":"'Betistuta MS'!C115","v":"Anadolu Efes"},{"$f":"'Betistuta MS'!D115","v":"75-70"},{"$f":"'Betistuta MS'!E115","v":"Olimpia Mila"},{"$f":"'Betistuta MS'!F115","v":"42-43"}]
[{"$f":"'Betistuta MS'!A116","v":"D"},{"$f":"'Betistuta MS'!B116","v":"2022-04-26"},{"$f":"'Betistuta MS'!C116","v":"Anadolu Efes"},{"$f":"'Betistuta MS'!D116","v":"77-65"},{"$f":"'Betistuta MS'!E116","v":"Olimpia Mila"},{"$f":"'Betistuta MS'!F116","v":"42-35"}]
[{"$f":"'Betistuta MS'!A117","v":"D"},{"$f":"'Betistuta MS'!B117","v":"2022-04-23"},{"$f":"'Betistuta MS'!C117","v":"Reggiana"},{"$f":"'Betistuta MS'!D117","v":"63-67"},{"$f":"'Betistuta MS'!E117","v":"Olimpia Mila"},{"$f":"'Betistuta MS'!F117","v":"29-39"}]
[{"$f":"'Betistuta MS'!A118","v":"D"},{"$f":"'Betistuta MS'!B118","v":"2022-04-10"},{"$f":"'Betistuta MS'!C118","v":"Virtus Bolog"},{"$f":"'Betistuta MS'!D118","v":"83-65"},{"$f":"'Betistuta MS'!E118","v":"Olimpia Mila"},{"$f":"'Betistuta MS'!F118","v":"46-34"}]
[{"$f":"'Betistuta MS'!A119","v":"D"},{"$f":"'Betistuta MS'!B119","v":"2022-04-07"},{"$f":"'Betistuta MS'!C119","v":"Lyon-Villeur"},{"$f":"'Betistuta MS'!D119","v":"80-81"},{"$f":"'Betistuta MS'!E119","v":"Olimpia Mila"},{"$f":"'Betistuta MS'!F119","v":"41-40"}]
[{"$f":"'Betistuta MS'!A120","v":"D"},{"$f":"'Betistuta MS'!B120","v":"2022-04-03"},{"$f":"'Betistuta MS'!C120","v":"Sassari"},{"$f":"'Betistuta MS'!D120","v":"92-90"},{"$f":"'Betistuta MS'!E120","v":"Olimpia Mila"},{"$f":"'Betistuta MS'!F120","v":"56-43"}]
[{"$f":"'Betistuta MS'!A121","v":"D"},{"$f":"'Betistuta MS'!B121","v":"2022-03-24"},{"$f":"'Betistuta MS'!C121","v":"Anadolu Efes"},{"$f":"'Betistuta MS'!D121","v":"77-83"},{"$f":"'Betistuta MS'!E121","v":"Olimpia Mila"},{"$f":"'Betistuta MS'!F121","v":"51-36"}]
[{"$f":"'Betistuta MS'!A122","v":"D"},{"$f":"'Betistuta MS'!B122","v":"2022-03-22"},{"$f":"'Betistuta MS'!C122","v":"Maccabi Tel"},{"$f":"'Betistuta MS'!D122","v":"75-58"},{"$f":"'Betistuta MS'!E122","v":"Olimpia Mila"},{"$f":"'Betistuta MS'!F122","v":"40-37"}]
[{"$f":"'Betistuta MS'!A123","v":"D"},{"$f":"'Betistuta MS'!B123","v":"2022-03-20"},{"$f":"'Betistuta MS'!C123","v":"Brescia"},{"$f":"'Betistuta MS'!D123","v":"82-74"},{"$f":"'Betistuta MS'!E123","v":"Olimpia Mila"},{"$f":"'Betistuta MS'!F123","v":"41-31"}]
[{"$f":"'Betistuta MS'!A124","v":"D"},{"$f":"'Betistuta MS'!B124","v":"2022-03-10"},{"$f":"'Betistuta MS'!C124","v":"Real Madrid"},{"$f":"'Betistuta MS'!D124","v":"81-81"},{"$f":"'Betistuta MS'!E124","v":"Olimpia Mila"},{"$f":"'Betistuta MS'!F124","v":"41-41"}]
[{"$f":"'Betistuta MS'!A125","v":"D"},{"$f":"'Betistuta MS'!B125","v":"2022-03-06"},{"$f":"'Betistuta MS'!C125","v":"Tortona"},{"$f":"'Betistuta MS'!D125","v":"64-81"},{"$f":"'Betistuta MS'!E125","v":"Olimpia Mila"},{"$f":"'Betistuta MS'!F125","v":"37-40"}]
[{"$f":"'Betistuta MS'!A126","v":"D"},{"$f":"'Betistuta MS'!B126","v":"2022-03-04"},{"$f":"'Betistuta MS'!C126","v":"Panathinaiko"},{"$f":"'Betistuta MS'!D126","v":"75-76"},{"$f":"'Betistuta MS'!E126","v":"Olimpia Mila"},{"$f":"'Betistuta MS'!F126","v":"36-40"}]
[{"$f":"'Betistuta MS'!A127","v":"D"},{"$f":"'Betistuta MS'!B127","v":"2022-02-24"},{"$f":"'Betistuta MS'!C127","v":"Olympiacos"},{"$f":"'Betistuta MS'!D127","v":"67-58"},{"$f":"'Betistuta MS'!E127","v":"Olimpia Mila"},{"$f":"'Betistuta MS'!F127","v":"25-27"}]
[{"$f":"'Betistuta MS'!A128","v":"D"},{"$f":"'Betistuta MS'!B128","v":"2022-02-08"},{"$f":"'Betistuta MS'!C128","v":"Zalgiris Kau"},{"$f":"'Betistuta MS'!D128","v":"70-74"},{"$f":"'Betistuta MS'!E128","v":"Olimpia Mila"},{"$f":"'Betistuta MS'!F128","v":"35-35"}]
[{"$f":"'Betistuta MS'!A129","v":"D"},{"$f":"'Betistuta MS'!B129","v":"2022-02-05"},{"$f":"'Betistuta MS'!C129","v":"Trento"},{"$f":"'Betistuta MS'!D129","v":"73-79"},{"$f":"'Betistuta MS'!E129","v":"Olimpia Mila"},{"$f":"'Betistuta MS'!F129","v":"40-40"}]
[" ","G","M","AS","YS"]
["İlk Yarı",{"$f":"'Betistuta MS'!B131","v":9},{"$f":"'Betistuta MS'!C131","v":8},{"$f":"'Betistuta MS'!D131","v":743},{"$f":"'Betistuta MS'!E131","v":760}]
["Maç Sonu",{"$f":"'Betistuta MS'!B132","v":11},{"$f":"'Betistuta MS'!C132","v":8},{"$f":"'Betistuta MS'!D132","v":1492},{"$f":"'Betistuta MS'!E132","v":1473}]
[" "," "]
["Rekabet Analizi"]
[" ","Tarih","EvSahibi","MS","Deplasman","İY","Lig"]
["Detay",{"$f":"'Betistuta MS'!B136","v":"2022-06-08"},{"$f":"'Betistuta MS'!C136","v":"Virtus Bologna"},{"$f":"'Betistuta MS'!D136","v":"62-66"},{"$f":"'Betistuta MS'!E136","v":"Olimpia Milano"},{"$f":"'Betistuta MS'!F136","v":"27-28"},"BSN"]
["Detay",{"$f":"'Betistuta MS'!B137","v":"2022-04-10"},{"$f":"'Betistuta MS'!C137","v":"Virtus Bologna"},{"$f":"'Betistuta MS'!D137","v":"83-65"},{"$f":"'Betistuta MS'!E137","v":"Olimpia Milano"},{"$f":"'Betistuta MS'!F137","v":"46-34"},"BSN"]
["Detay",{"$f":"'Betistuta MS'!B138","v":"2021-06-11"},{"$f":"'Betistuta MS'!C138","v":"Virtus Bologna"},{"$f":"'Betistuta MS'!D138","v":"73-62"},{"$f":"'Betistuta MS'!E138","v":"Olimpia Milano"},{"$f":"'Betistuta MS'!F138","v":"41-43"},"BSN"]
["Detay",{"$f":"'Betistuta MS'!B139","v":"2021-06-09"},{"$f":"'Betistuta MS'!C139","v":"Virtus Bologna"},{"$f":"'Betistuta MS'!D139","v":"76-58"},{"$f":"'Betistuta MS'!E139","v":"Olimpia Milano"},{"$f":"'Betistuta MS'!F139","v":"37-34"},"BSN"]
["Detay",{"$f":"'Betistuta MS'!B140","v":"2020-12-27"},{"$f":"'Betistuta MS'!C140","v":"Virtus Bologna"},{"$f":"'Betistuta MS'!D140","v":"68-73"},{"$f":"'Betistuta MS'!E140","v":"Olimpia Milano"},{"$f":"'Betistuta MS'!F140","v":"38-46"},"BSN"]
["Detay",{"$f":"'Betistuta MS'!B141","v":"2019-12-29"},{"$f":"'Betistuta MS'!C141","v":"Virtus Bologna"},{"$f":"'Betistuta MS'!D141","v":"83-70"},{"$f":"'Betistuta MS'!E141","v":"Olimpia Milano"},{"$f":"'Betistuta MS'!F141","v":"46-40"},"BSN"]
["Detay","2018-07-10","Capitanes de Arecibo","85-73","San German"," ","BSN"]
["Detay","2018-05-07","Capitanes de Arecibo","97-87","San German","48-45","BSN"]
["Detay","2017-06-23","Capitanes de Arecibo","88-82","San German","52-43","BSN"]
["Detay","2017-04-07","Capitanes de Arecibo","87-77","San German","40-37","BSN"]
["Detay","2016-03-21","Capitanes de Arecibo","89-79","San German","39-37","BSN"]
["Detay","2015-04-28","Capitanes de Arecibo","92-84","San German","42-37","BSN 2015"]
["Detay","2015-04-05","Capitanes de Arecibo","91-77","San German","40-38","BSN 2015"]
[]
["Bahis oynayan tüm bireyler, bulunduğu ülkenin kural ve yasalarından sorumludur"]

{"sheet":"Nowgoal5","index":3,"n_rows":112,"n_cols":42,"rows_kept":112,"cut":false,"hidden":false,"merged":[[1,26,1,28],[1,29,1,31],[1,25,3,25],[8,17,9,17],[7,15,7,16],[2,18,2,19],[3,18,3,19],[4,18,4,19],[5,18,5,19],[6,18,6,19],[7,18,7,19],[1,15,1,16],[1,18,1,19],[2,15,2,16],[3,15,3,16],[4,15,4,16],[5,15,5,16],[6,15,6,16],[43,12,43,13],[50,2,50,3],[50,4,50,5],[50,6,50,7],[50,8,50,9],[50,10,50,11],[50,12,50,13],[43,2,43,3],[43,4,43,5],[43,6,43,7],[43,8,43,9],[43,10,43,11],[47,10,47,11],[48,10,48,11],[49,10,49,11],[47,12,47,13],[48,12,48,13],[49,12,49,13],[47,6,47,7],[48,6,48,7],[49,6,49,7],[47,8,47,9],[48,8,48,9],[49,8,49,9],[42,12,42,13],[39,2,39,3],[39,4,39,5],[39,6,39,7],[39,8,39,9],[39,10,39,11],[39,12,39,13],[42,2,42,3],[42,4,42,5],[42,6,42,7],[42,8,42,9],[42,10,42,11],[40,12,40,13],[41,2,41,3],[41,4,41,5],[41,6,41,7],[41,8,41,9],[41,10,41,11],[41,12,41,13],[40,2,40,3],[40,4,40,5],[40,6,40,7],[40,8,40,9],[40,10,40,11],[47,2,47,3],[48,2,48,3],[49,2,49,3],[47,4,47,5],[48,4,48,5],[49,4,49,5],[45,8,45,9],[45,10,45,11],[45,12,45,13],[46,2,46,3],[46,4,46,5],[46,6,46,7],[46,8,46,9],[46,10,46,11],[46,12,46,13],[45,0,46,0],[45,1,46,1],[45,2,45,3],[45,4,45,5],[45,6,45,7],[38,4,38,5],[38,6,38,7],[38,8,38,9],[38,10,38,11],[38,12,38,13],[26,0,27,0],[32,0,33,0],[38,0,39,0],[38,1,39,1],[38,2,38,3],[26,12,26,13],[26,1,27,1],[32,1,33,1],[32,2,32,3],[32,4,32,5],[32,6,32,7],[32,8,32,9],[32,10,32,11],[32,12,32,13],[26,2,26,3],[26,4,26,5],[26,6,26,7],[26,8,26,9],[26,10,26,11]]}
["Average Get/Miss Comparison",null,null,null,null,null,null,null,null,null,null,null,null,null,null,null,null,{"$f":"IF(R12>'Betistuta MS'!AA28,\"ÜST\",\"ALT\")","v":"ALT"}]
["Virtus Bologna  ",null,null,null,null,null,null,null,null,null,null,null,null,null,null,{"$f":"A2","v":"Virtus Bologna  "},null,{"$f":"CONCATENATE((R11),\"  /  \",(R12))","v":"69  /  145"},{"$f":"A9","v":"EA7-Emporio Armani Milano  "},null,null,null,null,null,null,"BET365","HANDİKAP ODDS",null,null,"O/U ODDS",null,null,null,null,null,null,null,null,8,{"$f":"$O$3","v":0}," ALT","OYNA"]
[10,null,null,null,null,null,null,null,null,null,null,null,null,null,null,{"$f":"C54","v":19.390083180133725},null,"1. PERİYOT",{"$f":"D54","v":16.128823821271499},null,null,null,null,null,null,null,{"$f":"B17","v":"0.91"},{"$f":"C18","v":"3.5"},{"$f":"C19","v":"0.91"},{"$f":"C20","v":"0.95"},{"$f":"C21","v":"153.5"},{"$f":"C22","v":"0.87"},null,{"$f":"(SUBSTITUTE(AE3,\".\",\",\")*1)+5","v":158.5},{"$f":"(SUBSTITUTE(AE3,\".\",\",\")*1)+2","v":155.5},{"$f":"(SUBSTITUTE(AE3,\".\",\",\")*1)-(SUBSTITUTE(AE4,\".\",\",\")*1)","v":1},null,"ALT",7,{"$f":"$O$3","v":0}," ALT","OYNA"]
["Matches","Q1","Q2","Q3","Q4","OT","Full Time",null,null,null,null,null,null,null,null,{"$f":"C55","v":14.973183184883366},null,"2. PERİYOT",{"$f":"D55","v":20.026313243357468},null,null,null,null,null,null,null,{"$f":"B18","v":"0.80"},{"$f":"B19","v":"3.5"},{"$f":"B20","v":"0.95"},{"$f":"B21","v":"0.86"},{"$f":"B22","v":"152.5"},{"$f":"B23","v":"0.86"},null,{"$f":"(SUBSTITUTE(AE3,\".\",\",\")*1)-8","v":145.5},{"$f":"(SUBSTITUTE(AE3,\".\",\",\")*1)-4","v":149.5},null,null,"ÜST",6,{"$f":"$O$3","v":0}," ALT","OYNA"]
["G","L","G","L","G","L","G","L","G","L","G","L",null,null,null,{"$f":"INT(SUM(P3:Q4))","v":34},null,"İLK YARI",{"$f":"INT(SUM(S3:T4))","v":36},null,null,null,null,null,null,null,null,null,null,null,null,null,null,null,null,null,null,null,5,{"$f":"$O$3","v":0}," ALT","OYNA"]
["Total",8,18,18,20,15,19,17,20,16,0,0,76,66,null,{"$f":"C56","v":17.766845106954793},null,"3. PERİYOT",{"$f":"D56","v":15.787520521676845},null,null,null,null,null,null,null,null,null,null,null,null,null,null,null,null,null,null,null,4,{"$f":"$O$3","v":0}," ALT","OYNA"]
["Home",6,17,19,19,14,18,18,22,16,0,0,76,67,null,{"$f":"D57","v":24.334553659433507},null,"4. PERİYOT",{"$f":"C57","v":11.385543580936634},null,null,null,null,null,null,null,null,null,{"$f":"VLOOKUP(AJ3,AM2:AP112,2,FALSE)","v":"BELİRSİZ"},{"$f":"VLOOKUP(AJ3,AM2:AP112,3,FALSE)","v":"ARALIK"},{"$f":"VLOOKUP(AJ3,AM2:AP112,4,FALSE)","v":"DİKKAT"},null,null,null,null,null,null,null,3,{"$f":"AH3","v":158.5}," ALT","OYNA"]
["Away",2,20,16,22,18,20,14,16,14,0,0,76,62,null,{"$f":"ROUNDUP(SUM(P5:Q7),0)+2","v":79},null,"MAÇ SONU",{"$f":"ROUNDUP(SUM(S5:T7),0)+2","v":66},null,null,null,null,null,null,null,null,null,null,null,null,null,null,null,null,null,null,null,2,{"$f":"AH3","v":158.5}," ALT","OYNA"]
["EA7-Emporio Armani Milano  ",null,null,null,null,null,null,null,null,null,null,null,null,null,null,null,null,{"$f":"CONCATENATE(IF(P5>S5,\"İY1\",\"İY2\"),\"  /  \",IF(P8>S8,\"MS1\",\"MS2\"))","v":"İY2  /  MS1"},null,null,null,null,null,null,null,null,null,null,null,null,null,null,null,null,null,null,null,null,1,"BELİRSİZ","ARALIK","DİKKAT"]
[10,null,null,null,null,null,null,null,null,null,null,null,null,null,null,null,null,null,null,null,null,null,null,null,null,null,null,null,null,null,null,null,null,null,null,null,null,null,0,"BELİRSİZ","ARALIK","DİKKAT"]
["Matches","Q1","Q2","Q3","Q4","OT","Full Time",null,null,null,null,null,null,null,null,null,"İLK YARI",{"$f":"N59","v":69},null,null,null,null,null,null,null,null,null,null,null,null,null,null,null,null,null,null,null,null,-1,"BELİRSİZ","ARALIK","DİKKAT"]
["G","L","G","L","G","L","G","L","G","L","G","L",null,null,null,null,"MAÇ SONU",{"$f":"P8+S8","v":145},null,null,null,null,null,null,null,null,null,null,null,null,null,null,null,null,null,null,null,null,-2,{"$f":"AH4","v":145.5}," ÜST","OYNA"]
["Total",8,22,17,22,19,23,17,16,18,0,0,84,71,null,null,null,null,null,null,null,null,null,null,null,null,null,null,null,null,null,null,null,null,null,null,null,null,-3,{"$f":"AH4","v":145.5}," ÜST","OYNA"]
["Home",4,26,19,24,22,24,18,16,17,0,0,90,75,null,null,null,null,null,null,null,null,null,null,null,null,null,null,null,null,null,null,null,null,null,null,null,null,-4,{"$f":"$O$4","v":0}," ÜST","OYNA"]
["Away",4,18,15,20,17,22,16,16,19,0,0,78,66,null,null,null,null,null,null,null,null,null,null,null,null,null,null,null,null,null,null,null,null,null,null,null,null,-5,{"$f":"$O$4","v":0}," ÜST","OYNA"]
[null,null,null,null,null,null,null,null,null,null,null,null,null,null,null,null,null,null,null,null,null,null,null,null,null,null,null,null,null,null,null,null,null,null,null,null,null,null,-6,{"$f":"$O$4","v":0}," ÜST","OYNA"]
["BET365 ODDS    ","0.91",null,null,null,null,null,null,null,null,null,null,{"$f":"M6+M7+M8-N6-N7-N8","v":33},{"$f":"M13+M14+M15-N13-N14-N15","v":40},null,null,null,null,null,null,null,null,null,null,null,null,null,null,null,null,null,null,null,null,null,null,null,null,-7,{"$f":"$O$4","v":0}," ÜST","OYNA"]
[null,"0.80","3.5",null,null,null,null,null,null,null,null,null,null,{"$f":"IF(N17>M17,\"MS2\",\"MS1\")","v":"MS2"},null,null,null,null,null,null,null,null,null,null,null,null,null,null,null,null,null,null,null,null,null,null,null,null,-8,{"$f":"$O$4","v":0}," ÜST","OYNA"]
[null,"3.5","0.91",null,null,null,null,null,null,null,null,null,null,{"$f":"(N17-M17)/2","v":3.5},null,null,null,null,null,null,null,null,null,null,null,null,null,null,null,null,null,null,null,null,null,null,null,null,0.5,"BELİRSİZ","ARALIK","DİKKAT"]
[null,"0.95","0.95",null,null,null,null,null,null,null,null,null,null,null,null,null,null,null,null,null,null,null,null,null,null,null,null,null,null,null,null,null,null,null,null,null,null,null,1.5,"BELİRSİZ","ARALIK","DİKKAT"]
[null,"0.86","153.5",null,null,null,null,null,null,null,null,null,null,null,null,null,null,null,null,null,null,null,null,null,null,null,null,null,null,null,null,null,null,null,null,null,null,null,2.5,{"$f":"AN8","v":158.5}," ALT","OYNA"]
[null,"152.5","0.87",null,null,null,null,null,null,null,null,null,null,null,null,null,null,null,null,null,null,null,null,null,null,null,null,null,null,null,null,null,null,null,null,null,null,null,3.5,{"$f":"AN7","v":158.5}," ALT","OYNA"]
[null,"0.86",null,null,null,null,null,null,null,null,null,null,null,null,null,null,null,null,null,null,null,null,null,null,null,null,null,null,null,null,null,null,null,null,null,null,null,null,4.5,{"$f":"$O$3","v":0}," ALT","OYNA"]
[null,null,null,null,null,null,null,null,null,null,null,null,null,null,null,null,null,null,null,null,null,null,null,null,null,null,null,null,null,null,null,null,null,null,null,null,null,null,5.5,{"$f":"$O$3","v":0}," ALT","OYNA"]
[null,null,null,null,null,null,null,null,null,null,null,null,null,null,null,null,null,null,null,null,null,null,null,null,null,null,null,null,null,null,null,null,null,null,null,null,null,null,6.5,0," ALT","OYNA"]
[null,null,null,null,null,null,null,null,null,null,null,null,null,null,null,null,null,null,null,null,null,null,null,null,null,null,null,null,null,null,null,null,null,null,null,null,null,null,7.5,0," ALT","OYNA"]
[{"$f":"A2","v":"Virtus Bologna  "},null,"P1",null,"P2",null,"P3",null,"P4",null,"OT",null,"FT",null,null,null,null,null,null,null,null,null,null,null,null,null,null,null,null,null,null,null,null,null,null,null,null,null,8.5,0," ALT","OYNA"]
[null,null,"(L/G)","G_dep","(L/G)","G_dep","(L/G)","G_dep","(L/G)","G_dep","(L/G)","G_dep","(L/G)","G_dep",null,null,null,null,null,null,null,null,null,null,null,null,null,null,null,null,null,null,null,null,null,null,null,null,-0.5,"BELİRSİZ","ARALIK","DİKKAT"]
["Total",{"$f":"B6","v":8},{"$f":"IFERROR(D6/C6,0)","v":1},{"$f":"C13","v":22},{"$f":"IFERROR(F6/E6,0)","v":0.75},{"$f":"E13","v":22},{"$f":"IFERROR(H6/G6,0)","v":0.89473684210526316},{"$f":"G13","v":23},{"$f":"IFERROR(J6/I6,0)","v":0.8},{"$f":"I13","v":16},{"$f":"IFERROR(L6/K6,0)","v":0},{"$f":"K13","v":0},{"$f":"IFERROR(N6/M6,0)","v":0.86842105263157898},{"$f":"M13","v":84},null,null,null,null,null,null,null,null,null,null,null,null,null,null,null,null,null,null,null,null,null,null,null,null,-1.5,"BELİRSİZ","ARALIK","DİKKAT"]
["Home",{"$f":"B7","v":6},{"$f":"IFERROR(D7/C7,0)","v":1.1176470588235294},{"$f":"C14","v":26},{"$f":"IFERROR(F7/E7,0)","v":0.73684210526315785},{"$f":"E14","v":24},{"$f":"IFERROR(H7/G7,0)","v":1},{"$f":"G14","v":24},{"$f":"IFERROR(J7/I7,0)","v":0.72727272727272729},{"$f":"I14","v":16},{"$f":"IFERROR(L7/K7,0)","v":0},{"$f":"K14","v":0},{"$f":"IFERROR(N7/M7,0)","v":0.88157894736842102},{"$f":"M14","v":90},null,null,null,null,null,null,null,null,null,null,null,null,null,null,null,null,null,null,null,null,null,null,null,null,-2.5,{"$f":"AN12","v":145.5}," ÜST","OYNA"]
["Away",{"$f":"B8","v":2},{"$f":"IFERROR(D8/C8,0)","v":0.8},{"$f":"C15","v":18},{"$f":"IFERROR(F8/E8,0)","v":0.81818181818181823},{"$f":"E15","v":20},{"$f":"IFERROR(H8/G8,0)","v":0.7},{"$f":"G15","v":22},{"$f":"IFERROR(J8/I8,0)","v":0.875},{"$f":"I15","v":16},{"$f":"IFERROR(L8/K8,0)","v":0},{"$f":"K15","v":0},{"$f":"IFERROR(N8/M8,0)","v":0.81578947368421051},{"$f":"M15","v":78},null,null,null,null,null,null,null,null,null,null,null,null,null,null,null,null,null,null,null,null,null,null,null,null,-3.5,{"$f":"AN13","v":145.5}," ÜST","OYNA"]
[null,null,null,null,null,null,null,null,null,null,null,null,null,null,null,null,null,null,null,null,null,null,null,null,null,null,null,null,null,null,null,null,null,null,null,null,null,null,-4.5,{"$f":"AN14","v":0}," ÜST","OYNA"]
[{"$f":"A9","v":"EA7-Emporio Armani Milano  "},null,"P1",null,"P2",null,"P3",null,"P4",null,"OT",null,"FT",null,null,null,null,null,null,null,null,null,null,null,null,null,null,null,null,null,null,null,null,null,null,null,null,null,-5.5,{"$f":"AN15","v":0}," ÜST","OYNA"]
[null,null,"(L/G)","G_ev","(L/G)","G_ev","(L/G)","G_ev","(L/G)","G_ev","(L/G)","G_ev","(L/G)","G_ev",null,null,null,null,null,null,null,null,null,null,null,null,null,null,null,null,null,null,null,null,null,null,null,null,-6.5,0," ÜST","OYNA"]
["Total",{"$f":"B13","v":8},{"$f":"IFERROR(D13/C13,0)","v":0.77272727272727271},{"$f":"C6","v":18},{"$f":"IFERROR(F13/E13,0)","v":0.86363636363636365},{"$f":"E6","v":20},{"$f":"IFERROR(H13/G13,0)","v":0.73913043478260865},{"$f":"G6","v":19},{"$f":"IFERROR(J13/I13,0)","v":1.125},{"$f":"I6","v":20},{"$f":"IFERROR(L13/K13,0)","v":0},{"$f":"K6","v":0},{"$f":"IFERROR(N13/M13,0)","v":0.84523809523809523},{"$f":"M6","v":76},null,null,null,null,null,null,null,null,null,null,null,null,null,null,null,null,null,null,null,null,null,null,null,null,-7.5,0," ÜST","OYNA"]
["Home",{"$f":"B14","v":4},{"$f":"IFERROR(D14/C14,0)","v":0.73076923076923073},{"$f":"C7","v":17},{"$f":"IFERROR(F14/E14,0)","v":0.91666666666666663},{"$f":"E7","v":19},{"$f":"IFERROR(H14/G14,0)","v":0.75},{"$f":"G7","v":18},{"$f":"IFERROR(J14/I14,0)","v":1.0625},{"$f":"I7","v":22},{"$f":"IFERROR(L14/K14,0)","v":0},{"$f":"K7","v":0},{"$f":"IFERROR(N14/M14,0)","v":0.83333333333333337},{"$f":"M7","v":76},null,null,null,null,null,null,null,null,null,null,null,null,null,null,null,null,null,null,null,null,null,null,null,null,-8.5,0," ÜST","OYNA"]
["Away",{"$f":"B15","v":4},{"$f":"IFERROR(D15/C15,0)","v":0.83333333333333337},{"$f":"C8","v":20},{"$f":"IFERROR(F15/E15,0)","v":0.85},{"$f":"E8","v":22},{"$f":"IFERROR(H15/G15,0)","v":0.72727272727272729},{"$f":"G8","v":20},{"$f":"IFERROR(J15/I15,0)","v":1.1875},{"$f":"I8","v":16},{"$f":"IFERROR(L15/K15,0)","v":0},{"$f":"K8","v":0},{"$f":"IFERROR(N15/M15,0)","v":0.84615384615384615},{"$f":"M8","v":76},null,null,null,null,null,null,null,null,null,null,null,null,null,null,null,null,null,null,null,null,null,null,null,null,9,"FARK","UYGUN ","DEĞİL"]
[null,null,null,null,null,null,null,null,null,null,null,null,null,null,null,null,null,null,null,null,null,null,null,null,null,null,null,null,null,null,null,null,null,null,null,null,null,null,9.5,"FARK","UYGUN ","DEĞİL"]
[{"$f":"A27","v":"Virtus Bologna  "},null,"P1",null,"P2",null,"P3",null,"P4",null,"OT",null,"FT",null,null,null,null,null,null,null,null,null,null,null,null,null,null,null,null,null,null,null,null,null,null,null,null,null,10,"FARK","UYGUN ","DEĞİL"]
[null,null,"(L/G)*G_dep",null,"(L/G)*G_dep",null,"(L/G)*G_dep",null,"(L/G)*G_dep",null,"(L/G)*G_dep",null,"(L/G)*G_dep",null,null,null,null,null,null,null,null,null,null,null,null,null,null,null,null,null,null,null,null,null,null,null,null,null,10.5,"FARK","UYGUN ","DEĞİL"]
["Total",{"$f":"B29","v":8},{"$f":"C29*D29","v":22},null,{"$f":"E29*F29","v":16.5},null,{"$f":"G29*H29","v":20.578947368421051},null,{"$f":"I29*J29","v":12.8},null,{"$f":"K29*L29","v":0},null,{"$f":"M29*N29","v":72.94736842105263},null,null,null,null,null,null,null,null,null,null,null,null,null,null,null,null,null,null,null,null,null,null,null,null,null,11,"FARK","UYGUN ","DEĞİL"]
["Home",{"$f":"B30","v":6},{"$f":"C30*D30","v":29.058823529411764},null,{"$f":"E30*F30","v":17.684210526315788},null,{"$f":"G30*H30","v":24},null,{"$f":"I30*J30","v":11.636363636363637},null,{"$f":"K30*L30","v":0},null,{"$f":"M30*N30","v":79.34210526315789},null,null,null,null,null,null,null,null,null,null,null,null,null,null,null,null,null,null,null,null,null,null,null,null,null,11.5,"FARK","UYGUN ","DEĞİL"]
["Away",2,14.4,null,16.363636363636363,null,15.399999999999999,null,14,null,{"$f":"K31*L31","v":0},null,63.631578947368418,null,null,null,null,null,null,null,null,null,null,null,null,null,null,null,null,null,null,null,null,null,null,null,null,null,12,"FARK","UYGUN ","DEĞİL"]
["TOPLAM",null,{"$f":"SUM(C41:D43)/3","v":21.819607843137259},null,{"$f":"SUM(E41:F43)/3","v":16.849282296650717},null,{"$f":"SUM(G41:H43)/3","v":19.99298245614035},null,{"$f":"SUM(I41:J43)/3","v":12.812121212121212},null,{"$f":"SUM(K41:L43)/3","v":0},null,{"$f":"SUM(M41:N43)/3","v":71.973684210526315},null,null,null,null,null,null,null,null,null,null,null,null,null,null,null,null,null,null,null,null,null,null,null,null,null,12.5,"FARK","UYGUN ","DEĞİL"]
[null,null,null,null,null,null,null,null,null,null,null,null,null,null,null,null,null,null,null,null,null,null,null,null,null,null,null,null,null,null,null,null,null,null,null,null,null,null,13,"FARK","UYGUN ","DEĞİL"]
[{"$f":"A33","v":"EA7-Emporio Armani Milano  "},null,"P1",null,"P2",null,"P3",null,"P4",null,"OT",null,"FT",null,null,null,null,null,null,null,null,null,null,null,null,null,null,null,null,null,null,null,null,null,null,null,null,null,13.5,"FARK","UYGUN ","DEĞİL"]
[null,null,"(L/G)*G_ev",null,"(L/G)*G_ev",null,"(L/G)*G_ev",null,"(L/G)*G_ev",null,"(L/G)*G_ev",null,"(L/G)*G_ev",null,null,null,null,null,null,null,null,null,null,null,null,null,null,null,null,null,null,null,null,null,null,null,null,null,14,"FARK","UYGUN ","DEĞİL"]
["Total",{"$f":"B35","v":8},{"$f":"C35*D35","v":13.909090909090908},null,{"$f":"E35*F35","v":17.272727272727273},null,{"$f":"G35*H35","v":14.043478260869565},null,{"$f":"I35*J35","v":22.5},null,{"$f":"K35*L35","v":0},null,{"$f":"M35*N35","v":64.238095238095241},null,null,null,null,null,null,null,null,null,null,null,null,null,null,null,null,null,null,null,null,null,null,null,null,null,14.5,"FARK","UYGUN ","DEĞİL"]
["Home",{"$f":"B36","v":4},{"$f":"C36*D36","v":12.423076923076922},null,{"$f":"E36*F36","v":17.416666666666664},null,{"$f":"G36*H36","v":13.5},null,{"$f":"I36*J36","v":23.375},null,{"$f":"K36*L36","v":0},null,{"$f":"M36*N36","v":63.333333333333336},null,null,null,null,null,null,null,null,null,null,null,null,null,null,null,null,null,null,null,null,null,null,null,null,null,15,"FARK","UYGUN ","DEĞİL"]
["Away",4,16.666666666666668,null,18.7,null,14.545454545454547,null,19,null,0,null,64.307692307692307,null,null,null,null,null,null,null,null,null,null,null,null,null,null,null,null,null,null,null,null,null,null,null,null,null,15.5,"FARK","UYGUN ","DEĞİL"]
["TOPLAM",null,{"$f":"SUM(C48:D50)/3","v":14.332944832944833},null,{"$f":"SUM(E48:F50)/3","v":17.796464646464646},null,{"$f":"SUM(G48:H50)/3","v":14.029644268774703},null,{"$f":"SUM(I48:J50)/3","v":21.625},null,{"$f":"SUM(K48:L50)/3","v":0},null,{"$f":"SUM(M48:N50)/3","v":63.959706959706956},null,null,null,null,null,null,null,null,null,null,null,null,null,null,null,null,null,null,null,null,null,null,null,null,null,16,"FARK","UYGUN ","DEĞİL"]
[null,null,null,null,null,null,null,null,null,null,null,null,null,null,null,null,null,null,null,null,null,null,null,null,null,null,null,null,null,null,null,null,null,null,null,null,null,null,16.5,"FARK","UYGUN ","DEĞİL"]
[null,null,null,null,null,null,null,null,null,null,null,null,null,null,null,null,null,null,null,null,null,null,null,null,null,null,null,null,null,null,null,null,null,null,null,null,null,null,17,"FARK","UYGUN ","DEĞİL"]
[null,"1.P",{"$f":"C44*M51/M44","v":19.390083180133725},{"$f":"C51*M44/M51","v":16.128823821271499},{"$f":"MIN(C44,C51)/2","v":7.1664724164724163},null,"1.P",{"$f":"INT(IF(C44>C51,C54+E54,C54))","v":26},{"$f":"INT(IF(C44>C51,D54-E54,D54))","v":8},{"$f":"SUM(H54:I54)","v":34},null,null,null,null,null,null,null,null,null,null,null,null,null,null,null,null,null,null,null,null,null,null,null,null,null,null,null,null,17.5,"FARK","UYGUN ","DEĞİL"]
[null,"2.P",{"$f":"E44*M51/M44","v":14.973183184883366},{"$f":"E51*M44/M51","v":20.026313243357468},{"$f":"MIN(E44,E51)/2","v":8.4246411483253585},null,"2.P",{"$f":"INT(IF(E44>E51,C55-E55*2,C55))","v":14},{"$f":"INT(IF(E44>E51,D55+E55,D55))","v":20},{"$f":"SUM(H55:I55)","v":34},null,null,null,null,null,null,null,null,null,null,null,null,null,null,null,null,null,null,null,null,null,null,null,null,null,null,null,null,18,"FARK","UYGUN ","DEĞİL"]
[null,"3.P",{"$f":"G44*M51/M44","v":17.766845106954793},{"$f":"G51*M44/M51","v":15.787520521676845},{"$f":"MIN(G44,G51)/2","v":7.0148221343873516},null,"3.P",{"$f":"INT(IF(G44>G51,C56,C56+E56))","v":17},{"$f":"INT(IF(G44>G51,D56,D56-E56*2))","v":15},32,null,null,null,null,null,null,null,null,null,null,null,null,null,null,null,null,null,null,null,null,null,null,null,null,null,null,null,null,18.5,"FARK","UYGUN ","DEĞİL"]
[null,"4.P",{"$f":"I44*M51/M44","v":11.385543580936634},{"$f":"I51*M44/M51","v":24.334553659433507},{"$f":"MIN(I44,I51)/2","v":6.4060606060606062},null,"4.P",{"$f":"INT(IF(I44>I51,C57,C57-E57))","v":4},{"$f":"INT(IF(G44>G51,D57,D57-E57))","v":24},28,null,null,null,null,null,null,null,null,null,null,null,null,null,null,null,null,null,null,null,null,null,null,null,null,null,null,null,null,19,"FARK","UYGUN ","DEĞİL"]
[null,"FT",{"$f":"SUM(C54:C57)","v":63.515655052908521},{"$f":"SUM(D54:D57)","v":76.277211245739323},{"$f":"SUM(E54:E57)/B6","v":3.6264995381557164},null,"FT",{"$f":"SUM(H54:H57)","v":61},{"$f":"SUM(I54:I57)","v":67},{"$f":"SUM(H58:I58)","v":128},null,{"$f":"INT(((D58+H58)/2))","v":68},{"$f":"INT(((C58+I58)/2))","v":65},{"$f":"L58+M58","v":133},null,null,null,null,null,null,null,null,null,null,null,null,null,null,null,null,null,null,null,null,null,null,null,null,19.5,"FARK","UYGUN ","DEĞİL"]
[null,"HT",{"$f":"C54+C55","v":34.36326636501709},{"$f":"D54+D55","v":36.155137064628967},{"$f":"C59+D59","v":70.518403429646057},{"$f":"(E59-J59)/B6","v":0.31480042870575708},"HT",{"$f":"H54+H55","v":40},{"$f":"I54+I55","v":28},{"$f":"H59+I59","v":68},null,{"$f":"INT(((D59+H59)/2)*(E59/J59)+F59)","v":39},{"$f":"INT(((C59+I59)/2)*(J59/E59)+F59)","v":30},{"$f":"M59+L59","v":69},null,null,null,null,null,null,null,null,null,null,null,null,null,null,null,null,null,null,null,null,null,null,null,null,20,"FARK","UYGUN ","DEĞİL"]
[null,null,null,null,null,null,null,null,null,null,null,null,null,null,null,null,null,null,null,null,null,null,null,null,null,null,null,null,null,null,null,null,null,null,null,null,null,null,20.5,"FARK","UYGUN ","DEĞİL"]
[null,null,null,null,null,null,null,null,null,null,null,null,null,null,null,null,null,null,null,null,null,null,null,null,null,null,null,null,null,null,null,null,null,null,null,null,null,null,21,"FARK","UYGUN ","DEĞİL"]
[null,null,null,null,null,null,null,null,null,null,null,null,null,null,null,null,null,null,null,null,null,null,null,null,null,null,null,null,null,null,null,null,null,null,null,null,null,null,21.5,"FARK","UYGUN ","DEĞİL"]
[null,null,null,null,null,null,null,null,null,null,null,null,null,null,null,null,null,null,null,null,null,null,null,null,null,null,null,null,null,null,null,null,null,null,null,null,null,null,22,"FARK","UYGUN ","DEĞİL"]
[null,null,null,null,null,null,null,null,null,null,null,null,null,null,null,null,null,null,null,null,null,null,null,null,null,null,null,null,null,null,null,null,null,null,null,null,null,null,22.5,"FARK","UYGUN ","DEĞİL"]
[null,null,null,null,null,null,null,null,null,null,null,null,null,null,null,null,null,null,null,null,null,null,null,null,null,null,null,null,null,null,null,null,null,null,null,null,null,null,23,"FARK","UYGUN ","DEĞİL"]
[null,null,null,null,null,null,null,null,null,null,null,null,null,null,null,null,null,null,null,null,null,null,null,null,null,null,null,null,null,null,null,null,null,null,null,null,null,null,23.5,"FARK","UYGUN ","DEĞİL"]
[null,null,null,null,null,null,null,null,null,null,null,null,null,null,null,null,null,null,null,null,null,null,null,null,null,null,null,null,null,null,null,null,null,null,null,null,null,null,24,"FARK","UYGUN ","DEĞİL"]
[null,null,null,null,null,null,null,null,null,null,null,null,null,null,null,null,null,null,null,null,null,null,null,null,null,null,null,null,null,null,null,null,null,null,null,null,null,null,24.5,"FARK","UYGUN ","DEĞİL"]
[null,null,null,null,null,null,null,null,null,null,null,null,null,null,null,null,null,null,null,null,null,null,null,null,null,null,null,null,null,null,null,null,null,null,null,null,null,null,25,"FARK","UYGUN ","DEĞİL"]
[null,null,null,null,null,null,null,null,null,null,null,null,null,null,null,null,null,null,null,null,null,null,null,null,null,null,null,null,null,null,null,null,null,null,null,null,null,null,25.5,"FARK","UYGUN ","DEĞİL"]
[null,null,null,null,null,null,null,null,null,null,null,null,null,null,null,null,null,null,null,null,null,null,null,null,null,null,null,null,null,null,null,null,null,null,null,null,null,null,26,"FARK","UYGUN ","DEĞİL"]
[null,null,null,null,null,null,null,null,null,null,null,null,null,null,null,null,null,null,null,null,null,null,null,null,null,null,null,null,null,null,null,null,null,null,null,null,null,null,26.5,"FARK","UYGUN ","DEĞİL"]
[null,null,null,null,null,null,null,null,null,null,null,null,null,null,null,null,null,null,null,null,null,null,null,null,null,null,null,null,null,null,null,null,null,null,null,null,null,null,27,"FARK","UYGUN ","DEĞİL"]
[null,null,null,null,null,null,null,null,null,null,null,null,null,null,null,null,null,null,null,null,null,null,null,null,null,null,null,null,null,null,null,null,null,null,null,null,null,null,27.5,"FARK","UYGUN ","DEĞİL"]
[null,null,null,null,null,null,null,null,null,null,null,null,null,null,null,null,null,null,null,null,null,null,null,null,null,null,null,null,null,null,null,null,null,null,null,null,null,null,-9,"FARK","UYGUN ","DEĞİL"]
[null,null,null,null,null,null,null,null,null,null,null,null,null,null,null,null,null,null,null,null,null,null,null,null,null,null,null,null,null,null,null,null,null,null,null,null,null,null,-9.5,"FARK","UYGUN ","DEĞİL"]
[null,null,null,null,null,null,null,null,null,null,null,null,null,null,null,null,null,null,null,null,null,null,null,null,null,null,null,null,null,null,null,null,null,null,null,null,null,null,-10,"FARK","UYGUN ","DEĞİL"]
[null,null,null,null,null,null,null,null,null,null,null,null,null,null,null,null,null,null,null,null,null,null,null,null,null,null,null,null,null,null,null,null,null,null,null,null,null,null,-10.5,"FARK","UYGUN ","DEĞİL"]
[null,null,null,null,null,null,null,null,null,null,null,null,null,null,null,null,null,null,null,null,null,null,null,null,null,null,null,null,null,null,null,null,null,null,null,null,null,null,-11,"FARK","UYGUN ","DEĞİL"]
[null,null,null,null,null,null,null,null,null,null,null,null,null,null,null,null,null,null,null,null,null,null,null,null,null,null,null,null,null,null,null,null,null,null,null,null,null,null,-11.5,"FARK","UYGUN ","DEĞİL"]
[null,null,null,null,null,null,null,null,null,null,null,null,null,null,null,null,null,null,null,null,null,null,null,null,null,null,null,null,null,null,null,null,null,null,null,null,null,null,-12,"FARK","UYGUN ","DEĞİL"]
[null,null,null,null,null,null,null,null,null,null,null,null,null,null,null,null,null,null,null,null,null,null,null,null,null,null,null,null,null,null,null,null,null,null,null,null,null,null,-12.5,"FARK","UYGUN ","DEĞİL"]
[null,null,null,null,null,null,null,null,null,null,null,null,null,null,null,null,null,null,null,null,null,null,null,null,null,null,null,null,null,null,null,null,null,null,null,null,null,null,-13,"FARK","UYGUN ","DEĞİL"]
[null,null,null,null,null,null,null,null,null,null,null,null,null,null,null,null,null,null,null,null,null,null,null,null,null,null,null,null,null,null,null,null,null,null,null,null,null,null,-13.5,"FARK","UYGUN ","DEĞİL"]
[null,null,null,null,null,null,null,null,null,null,null,null,null,null,null,null,null,null,null,null,null,null,null,null,null,null,null,null,null,null,null,null,null,null,null,null,null,null,-14,"FARK","UYGUN ","DEĞİL"]
[null,null,null,null,null,null,null,null,null,null,null,null,null,null,null,null,null,null,null,null,null,null,null,null,null,null,null,null,null,null,null,null,null,null,null,null,null,null,-14.5,"FARK","UYGUN ","DEĞİL"]
[null,null,null,null,null,null,null,null,null,null,null,null,null,null,null,null,null,null,null,null,null,null,null,null,null,null,null,null,null,null,null,null,null,null,null,null,null,null,-15,"FARK","UYGUN ","DEĞİL"]
[null,null,null,null,null,null,null,null,null,null,null,null,null,null,null,null,null,null,null,null,null,null,null,null,null,null,null,null,null,null,null,null,null,null,null,null,null,null,-15.5,"FARK","UYGUN ","DEĞİL"]
[null,null,null,null,null,null,null,null,null,null,null,null,null,null,null,null,null,null,null,null,null,null,null,null,null,null,null,null,null,null,null,null,null,null,null,null,null,null,-16,"FARK","UYGUN ","DEĞİL"]
[null,null,null,null,null,null,null,null,null,null,null,null,null,null,null,null,null,null,null,null,null,null,null,null,null,null,null,null,null,null,null,null,null,null,null,null,null,null,-16.5,"FARK","UYGUN ","DEĞİL"]
[null,null,null,null,null,null,null,null,null,null,null,null,null,null,null,null,null,null,null,null,null,null,null,null,null,null,null,null,null,null,null,null,null,null,null,null,null,null,-17,"FARK","UYGUN ","DEĞİL"]
[null,null,null,null,null,null,null,null,null,null,null,null,null,null,null,null,null,null,null,null,null,null,null,null,null,null,null,null,null,null,null,null,null,null,null,null,null,null,-17.5,"FARK","UYGUN ","DEĞİL"]
[null,null,null,null,null,null,null,null,null,null,null,null,null,null,null,null,null,null,null,null,null,null,null,null,null,null,null,null,null,null,null,null,null,null,null,null,null,null,-18,"FARK","UYGUN ","DEĞİL"]
[null,null,null,null,null,null,null,null,null,null,null,null,null,null,null,null,null,null,null,null,null,null,null,null,null,null,null,null,null,null,null,null,null,null,null,null,null,null,-18.5,"FARK","UYGUN ","DEĞİL"]
[null,null,null,null,null,null,null,null,null,null,null,null,null,null,null,null,null,null,null,null,null,null,null,null,null,null,null,null,null,null,null,null,null,null,null,null,null,null,-19,"FARK","UYGUN ","DEĞİL"]
[null,null,null,null,null,null,null,null,null,null,null,null,null,null,null,null,null,null,null,null,null,null,null,null,null,null,null,null,null,null,null,null,null,null,null,null,null,null,-19.5,"FARK","UYGUN ","DEĞİL"]
[null,null,null,null,null,null,null,null,null,null,null,null,null,null,null,null,null,null,null,null,null,null,null,null,null,null,null,null,null,null,null,null,null,null,null,null,null,null,-20,"FARK","UYGUN ","DEĞİL"]
[null,null,null,null,null,null,null,null,null,null,null,null,null,null,null,null,null,null,null,null,null,null,null,null,null,null,null,null,null,null,null,null,null,null,null,null,null,null,-20.5,"FARK","UYGUN ","DEĞİL"]
[null,null,null,null,null,null,null,null,null,null,null,null,null,null,null,null,null,null,null,null,null,null,null,null,null,null,null,null,null,null,null,null,null,null,null,null,null,null,-21,"FARK","UYGUN ","DEĞİL"]
[null,null,null,null,null,null,null,null,null,null,null,null,null,null,null,null,null,null,null,null,null,null,null,null,null,null,null,null,null,null,null,null,null,null,null,null,null,null,-21.5,"FARK","UYGUN ","DEĞİL"]
[null,null,null,null,null,null,null,null,null,null,null,null,null,null,null,null,null,null,null,null,null,null,null,null,null,null,null,null,null,null,null,null,null,null,null,null,null,null,-22,"FARK","UYGUN ","DEĞİL"]
[null,null,null,null,null,null,null,null,null,null,null,null,null,null,null,null,null,null,null,null,null,null,null,null,null,null,null,null,null,null,null,null,null,null,null,null,null,null,-22.5,"FARK","UYGUN ","DEĞİL"]
[null,null,null,null,null,null,null,null,null,null,null,null,null,null,null,null,null,null,null,null,null,null,null,null,null,null,null,null,null,null,null,null,null,null,null,null,null,null,-23,"FARK","UYGUN ","DEĞİL"]
[null,null,null,null,null,null,null,null,null,null,null,null,null,null,null,null,null,null,null,null,null,null,null,null,null,null,null,null,null,null,null,null,null,null,null,null,null,null,-23.5,"FARK","UYGUN ","DEĞİL"]
[null,null,null,null,null,null,null,null,null,null,null,null,null,null,null,null,null,null,null,null,null,null,null,null,null,null,null,null,null,null,null,null,null,null,null,null,null,null,-24,"FARK","UYGUN ","DEĞİL"]
[null,null,null,null,null,null,null,null,null,null,null,null,null,null,null,null,null,null,null,null,null,null,null,null,null,null,null,null,null,null,null,null,null,null,null,null,null,null,-24.5,"FARK","UYGUN ","DEĞİL"]
[null,null,null,null,null,null,null,null,null,null,null,null,null,null,null,null,null,null,null,null,null,null,null,null,null,null,null,null,null,null,null,null,null,null,null,null,null,null,-25,"FARK","UYGUN ","DEĞİL"]
[null,null,null,null,null,null,null,null,null,null,null,null,null,null,null,null,null,null,null,null,null,null,null,null,null,null,null,null,null,null,null,null,null,null,null,null,null,null,-25.5,"FARK","UYGUN ","DEĞİL"]
[null,null,null,null,null,null,null,null,null,null,null,null,null,null,null,null,null,null,null,null,null,null,null,null,null,null,null,null,null,null,null,null,null,null,null,null,null,null,-26,"FARK","UYGUN ","DEĞİL"]
[null,null,null,null,null,null,null,null,null,null,null,null,null,null,null,null,null,null,null,null,null,null,null,null,null,null,null,null,null,null,null,null,null,null,null,null,null,null,-26.5,"FARK","UYGUN ","DEĞİL"]
[null,null,null,null,null,null,null,null,null,null,null,null,null,null,null,null,null,null,null,null,null,null,null,null,null,null,null,null,null,null,null,null,null,null,null,null,null,null,-27,"FARK","UYGUN ","DEĞİL"]
[null,null,null,null,null,null,null,null,null,null,null,null,null,null,null,null,null,null,null,null,null,null,null,null,null,null,null,null,null,null,null,null,null,null,null,null,null,null,-27.5,"FARK","UYGUN ","DEĞİL"]

{"sheet":"Betistuta Kullanımı","index":4,"n_rows":1,"n_cols":1,"rows_kept":1,"cut":false,"hidden":false,"merged":[[0,0,1,14]]}
["SARI HÜCREYE SADECE YAPIŞTIR"]

{"sheet":"Nowgoal5 Kullanımı","index":5,"n_rows":0,"n_cols":0,"rows_kept":0,"cut":false,"hidden":false,"merged":[]}

{"sheet":"MS","index":6,"n_rows":27,"n_cols":40,"rows_kept":27,"cut":false,"hidden":false,"merged":[[9,38,11,39],[14,0,14,4],[14,7,14,8],[14,16,14,19],[14,21,14,22],[14,23,14,24],[14,35,14,37],[0,35,0,37],[0,0,0,4],[0,7,0,8],[0,16,0,19],[0,21,0,22],[0,23,0,24]]}
[{"$f":"IF(COUNTIF(D2:E11,D2)>COUNTIF(D2:E11,E2),D2,E2)","v":"Virtus Bolog"},null,null,null,null,"SONUÇ","BUL","SONUÇ",null,"TG","GT","PKT","PERF","FORM","FARK","TOPLAM",{"$f":"A1","v":"Virtus Bolog"},null,null,null,"BUL","SONUÇ",null,"SONUÇ",null,"TG","GT","PKT","PERF","FORM","TD","OV","İÇ SAHA","GENEL","İSTATİSTİK","EV SAHİBİ",null,null,{"$f":"AJ1","v":"EV SAHİBİ"},{"$f":"AJ15","v":"DEPLASMAN"}]
[1,{"$f":"'Betistuta MS'!B48","v":"2022-06-08"},{"$f":"'Betistuta MS'!A48","v":"D"},{"$f":"'Betistuta MS'!C48","v":"Virtus Bolog"},{"$f":"'Betistuta MS'!E48","v":"Olimpia Mila"},{"$f":"'Betistuta MS'!D48","v":"62-66"},{"$f":"SEARCH(\"-\",F2)","v":3},{"$f":"LEFT(F2,G2-1)*1","v":62},{"$f":"MID(F2,G2+1,4)*1","v":66},{"$f":"IF(OR(H2=\"\",I2=\"\"),\"\",IF(D2=$A$1,H2,I2))","v":62},{"$f":"IF(OR(H2=\"\",I2=\"\"),\"\",IF(D2=$A$1,I2,H2))","v":66},{"$f":"IF(OR(J2=\"\",K2=\"\"),\"\",IF(J2>K2,3,IF(J2<K2,0,1)))","v":0},{"$f":"IF(L2=\"\",\"\",IF(L2=3,1,IF(L2=1,0.5,IF(L2=0,0))))","v":0},{"$f":"IF(L2=\"\",\"\",IF(L2=1,\"D\",IF(L2=0,\"L\",IF(L2=3,\"W\"))))","v":"L"},{"$f":"IF(OR(J2=\"\",K2=\"\"),\"\",J2-K2)","v":-4},{"$f":"IF(OR(H2=\"\",I2=\"\"),\"\",H2+I2)","v":128},1,{"$f":"IF(D2=$A$1,D2,\"-\")","v":"Virtus Bolog"},{"$f":"IF(D2=$A$1,E2,\"-\")","v":"Olimpia Mila"},{"$f":"IFERROR(IF(AND(R2=D2,S2=E2),F2,\"-\"),\"\")","v":"62-66"},{"$f":"IFERROR(SEARCH(\"-\",T2),\"\")","v":3},{"$f":"IFERROR(LEFT(T2,U2-1)*1,\"\")","v":62},{"$f":"IFERROR(MID(T2,U2+1,4)*1,\"\")","v":66},{"$f":"IFERROR(V2,\"\")","v":62},{"$f":"IFERROR(W2,\"\")","v":66},{"$f":"IF(OR(X2=\"\",Y2=\"\"),\"\",X2)","v":62},{"$f":"IF(OR(X2=\"\",Y2=\"\"),\"\",Y2)","v":66},{"$f":"IF(OR(Z2=\"\",AA2=\"\"),\"\",IF(Z2>AA2,3,IF(Z2<AA2,0,1)))","v":0},{"$f":"IF(AB2=\"\",\"\",IF(AB2=3,1,IF(AB2=1,0.5,IF(AB2=0,0))))","v":0},{"$f":"IF(AB2=\"\",\"\",IF(AB2=1,\"D\",IF(AB2=0,\"L\",IF(AB2=3,\"W\"))))","v":"L"},{"$f":"IF(OR(Z2=\"\",AA2=\"\"),\"\",Z2-AA2)","v":-4},{"$f":"IFERROR(SUM(Z2:AA2),\"\")","v":128},{"$f":"COUNT(X2:X11)","v":7},{"$f":"COUNT(H2:H11)","v":10},"Oynanan Maç Sayısı",1,{"$f":"J11","v":73},{"$f":"K11","v":108},{"$f":"(AK12+AL26)/2","v":68.5},{"$f":"(AL12+AK26)/2","v":70.5}]
[{"$f":"1+A2","v":2},{"$f":"'Betistuta MS'!B49","v":"2022-05-31"},{"$f":"'Betistuta MS'!A49","v":"D"},{"$f":"'Betistuta MS'!C49","v":"Tortona"},{"$f":"'Betistuta MS'!E49","v":"Virtus Bolog"},{"$f":"'Betistuta MS'!D49","v":"69-77"},3,69,77,77,69,{"$f":"IF(OR(J3=\"\",K3=\"\"),\"\",IF(J3>K3,3,IF(J3<K3,0,1)))","v":3},{"$f":"IF(L3=\"\",\"\",IF(L3=3,1,IF(L3=1,0.5,IF(L3=0,0))))","v":1},{"$f":"IF(L3=\"\",\"\",IF(L3=1,\"D\",IF(L3=0,\"L\",IF(L3=3,\"W\"))))","v":"W"},8,146,{"$f":"1+Q2","v":2},"-","-","-",{"$f":"IFERROR(SEARCH(\"-\",T3),\"\")","v":1},{"$f":"IFERROR(LEFT(T3,U3-1)*1,\"\")","v":""},{"$f":"IFERROR(MID(T3,U3+1,4)*1,\"\")","v":""},{"$f":"IFERROR(V3,\"\")","v":""},"",{"$f":"IF(OR(X3=\"\",Y3=\"\"),\"\",X3)","v":""},{"$f":"IF(OR(X3=\"\",Y3=\"\"),\"\",Y3)","v":""},{"$f":"IF(OR(Z3=\"\",AA3=\"\"),\"\",IF(Z3>AA3,3,IF(Z3<AA3,0,1)))","v":""},{"$f":"IF(AB3=\"\",\"\",IF(AB3=3,1,IF(AB3=1,0.5,IF(AB3=0,0))))","v":""},{"$f":"IF(AB3=\"\",\"\",IF(AB3=1,\"D\",IF(AB3=0,\"L\",IF(AB3=3,\"W\"))))","v":""},{"$f":"IF(OR(Z3=\"\",AA3=\"\"),\"\",Z3-AA3)","v":""},{"$f":"IFERROR(SUM(Z3:AA3),\"\")","v":0},{"$f":"SUM(Z2:Z11)","v":541},{"$f":"SUM(J2:J11)","v":766},"Attıkları Basket Sayısı",2,{"$f":"J10","v":79},{"$f":"K10","v":57},{"$f":"IF(AM2>=7,\"7\",IF(AM2>=6,\"6\",IF(AM2>=5,\"5\",IF(AM2>=4,\"4\",IF(AM2>=3,\"3\",IF(AM2>=2,\"2\",IF(AM2>=1,\"1\",\"0\")))))))","v":"7"},{"$f":"IF(AN2>=7,\"7\",IF(AN2>=6,\"6\",IF(AN2>=5,\"5\",IF(AN2>=4,\"4\",IF(AN2>=3,\"3\",IF(AN2>=2,\"2\",IF(AN2>=1,\"1\",\"0\")))))))","v":"7"}]
[{"$f":"1+A3","v":3},{"$f":"'Betistuta MS'!B50","v":"2022-05-29"},{"$f":"'Betistuta MS'!A50","v":"D"},{"$f":"'Betistuta MS'!C50","v":"Virtus Bolog"},{"$f":"'Betistuta MS'!E50","v":"Tortona"},{"$f":"'Betistuta MS'!D50","v":"91-70"},3,91,70,91,70,3,1,"W",21,161,{"$f":"1+Q3","v":3},"Virtus Bolog","Tortona","91-70",3,{"$f":"IFERROR(LEFT(T4,U4-1)*1,\"\")","v":91},70,91,70,91,70,3,1,"W",21,161,{"$f":"SUM(AA2:AA11)","v":460},{"$f":"SUM(K2:K11)","v":692},"Yedikleri Basket Sayısı",3,{"$f":"J9","v":80},{"$f":"K9","v":67},{"$f":"ROUNDDOWN(AM2+AN3/2+1,0)","v":73},{"$f":"ROUNDDOWN(AN2+AM3/2+1,0)","v":75}]
[4,{"$f":"'Betistuta MS'!B51","v":"2022-05-27"},{"$f":"'Betistuta MS'!A51","v":"D"},{"$f":"'Betistuta MS'!C51","v":"Virtus Bolog"},{"$f":"'Betistuta MS'!E51","v":"Tortona"},{"$f":"'Betistuta MS'!D51","v":"77-73"},3,77,73,77,73,3,1,"W",4,150,4,"Virtus Bolog","Tortona","77-73",3,{"$f":"IFERROR(LEFT(T5,U5-1)*1,\"\")","v":77},73,77,73,77,73,3,1,"W",4,150,{"$f":"AG3/AG2","v":77.285714285714292},{"$f":"AH3/AH2","v":76.599999999999994},"Attıkları Basket Sayısı Ortalaması",4,{"$f":"J8","v":82},{"$f":"K8","v":76},{"$f":"AM4-AN4","v":-2},{"$f":"AM2+AN2","v":139}]
[5,{"$f":"'Betistuta MS'!B52","v":"2022-05-19"},{"$f":"'Betistuta MS'!A52","v":"D"},{"$f":"'Betistuta MS'!C52","v":"Pesaro"},{"$f":"'Betistuta MS'!E52","v":"Virtus Bolog"},{"$f":"'Betistuta MS'!D52","v":"55-75"},3,55,75,75,55,3,1,"W",20,130,5,"-","-","-",1,"","","","","","","","","","",0,{"$f":"AG4/AG2","v":65.714285714285708},{"$f":"AH4/AH2","v":69.2},"Yedikleri Basket Sayısı Ortalaması",5,{"$f":"J7","v":70},{"$f":"K7","v":51},{"$f":"CONCATENATE(AM4,\" : \",AN4)","v":"73 : 75"},{"$f":"AM4+AN4","v":148}]
[6,{"$f":"'Betistuta MS'!B53","v":"2022-05-17"},{"$f":"'Betistuta MS'!A53","v":"D"},{"$f":"'Betistuta MS'!C53","v":"Virtus Bolog"},{"$f":"'Betistuta MS'!E53","v":"Pesaro"},{"$f":"'Betistuta MS'!D53","v":"70-51"},3,70,51,70,51,3,1,"W",19,121,6,"Virtus Bolog","Pesaro","70-51",3,70,51,70,51,70,51,3,1,"W",19,121,{"$f":"COUNTIF($AD$2:$AD$11,\"W\")/AG2","v":0.8571428571428571},{"$f":"COUNTIF($N$2:$N$11,\"W\")/AH2","v":0.8},"Galibiyet %",6,{"$f":"J6","v":75},{"$f":"K6","v":55},178.5,{"$f":"SUBSTITUTE(AM7,\",\",\".\")","v":"178.5"}]
[7,{"$f":"'Betistuta MS'!B54","v":"2022-05-15"},{"$f":"'Betistuta MS'!A54","v":"D"},{"$f":"'Betistuta MS'!C54","v":"Virtus Bolog"},{"$f":"'Betistuta MS'!E54","v":"Pesaro"},{"$f":"'Betistuta MS'!D54","v":"82-76"},3,82,76,82,76,3,1,"W",6,158,7,"Virtus Bolog","Pesaro","82-76",3,82,76,82,76,82,76,3,1,"W",6,158,{"$f":"COUNTIF($AD$2:$AD$11,\"D\")/AG2","v":0},{"$f":"COUNTIF($N$2:$N$11,\"D\")/AH2","v":0},"Beraberlik %",7,{"$f":"J5","v":77},{"$f":"K5","v":73},170.5,{"$f":"SUBSTITUTE(AM8+4,\",\",\".\")","v":"174.5"}]
[8,{"$f":"'Betistuta MS'!B55","v":"2022-05-11"},{"$f":"'Betistuta MS'!A55","v":"D"},{"$f":"'Betistuta MS'!C55","v":"Virtus Bolog"},{"$f":"'Betistuta MS'!E55","v":"Bursaspor"},{"$f":"'Betistuta MS'!D55","v":"80-67"},3,80,67,80,67,3,1,"W",13,147,8,"Virtus Bolog","Bursaspor","80-67",3,80,67,80,67,80,67,3,1,"W",13,147,{"$f":"COUNTIF($AD$2:$AD$11,\"L\")/AG2","v":0.14285714285714285},{"$f":"COUNTIF($N$2:$N$11,\"L\")/AH2","v":0.2},"Mağlubiyet %",8,{"$f":"J4","v":91},{"$f":"K4","v":70},{"$f":"CONCATENATE(\"TOPLAM : \",AN8,\" \",AN9)","v":"TOPLAM : 174.5 ÜST"},"ÜST"]
[9,{"$f":"'Betistuta MS'!B56","v":"2022-05-08"},{"$f":"'Betistuta MS'!A56","v":"D"},{"$f":"'Betistuta MS'!C56","v":"Virtus Bolog"},{"$f":"'Betistuta MS'!E56","v":"Brescia"},{"$f":"'Betistuta MS'!D56","v":"79-57"},3,79,57,79,57,3,1,"W",22,136,9,"Virtus Bolog","Brescia","79-57",3,79,57,79,57,79,57,3,1,"W",22,136,{"$f":"IF(OR(AH7=0,AH9=0),0,(AH7/AH9))","v":4},null,"Skor Olasılıkları",9,{"$f":"J3","v":77},{"$f":"K3","v":69},{"$f":"CONCATENATE(\"BEN SADECE TOPLAM SAYIYA BAKARAK OYNUYORUM\",\" \",\"MS-TOP.SAYI: \",AN6)","v":"BEN SADECE TOPLAM SAYIYA BAKARAK OYNUYORUM MS-TOP.SAYI: 148"}]
[10,{"$f":"'Betistuta MS'!B57","v":"2022-05-06"},{"$f":"'Betistuta MS'!A57","v":"D"},{"$f":"'Betistuta MS'!C57","v":"Sassari"},{"$f":"'Betistuta MS'!E57","v":"Virtus Bolog"},{"$f":"'Betistuta MS'!D57","v":"108-73"},4,108,73,73,108,0,0,"L",-35,181,10,"-","-","-",1,"","","","","","","","","","",0,{"$f":"IF(OR(AG7=0,AG9=0),0,(AG7/AG9))","v":6},null,"Genel Skor Olasılığı",10,{"$f":"J2","v":62},{"$f":"K2","v":66}]
[null,null,null,null,null,null,null,null,null,null,null,null,null,null,null,null,null,null,null,null,null,null,null,null,null,null,null,null,null,null,null,null,{"$f":"AVERAGE(AG10:AG11)","v":5},"EV",{"$f":"A1","v":"Virtus Bolog"},11,{"$f":"INT(FORECAST(AJ12,AK2:AK11,AJ2:AJ11))","v":74},{"$f":"INT(FORECAST(AJ12,AL2:AL11,AJ2:AJ11))","v":59}]
[null,null,null,null,null,null,null,{"$f":"SUM(H2:H12)","v":773},{"$f":"SUM(I2:I12)","v":685},766,692,null,null,null,{"$f":"SUM(O2:O12)","v":74},{"$f":"SUM(P2:P12)","v":1458},null,null,null,null,null,{"$f":"SUM(V2:V12)","v":541},{"$f":"SUM(W2:W12)","v":460},541,460,541,460,null,null,null,null,{"$f":"SUM(AF2:AF12)","v":1001},{"$f":"AI13","v":76.599999999999994},null,{"$f":"AH5","v":76.599999999999994},"ORT.",{"$f":"INT(AVERAGE(AK2:AK12))","v":76},{"$f":"INT(AVERAGE(AL2:AL12))","v":68},{"$f":"AN4","v":75},{"$f":"AM4","v":73}]
[]
[{"$f":"IF(COUNTIF(D16:E25,D16)>COUNTIF(D16:E25,E16),D16,E16)","v":"Olimpia Mila"},null,null,null,null,"SONUÇ","BUL","SONUÇ",null,"TG","GT","PKT","PERF","Form","FARK","TOPLAM",{"$f":"A15","v":"Olimpia Mila"},null,null,null,"BUL","SONUÇ",null,"SONUÇ",null,"TG","GT","PKT","PERF","FORM","TD","OV","İÇ SAHA","GENEL","İSTATİSTİK","DEPLASMAN"]
[1,{"$f":"'Betistuta MS'!B67","v":"2022-06-08"},{"$f":"'Betistuta MS'!A67","v":"D"},{"$f":"'Betistuta MS'!C67","v":"Virtus Bolog"},{"$f":"'Betistuta MS'!E67","v":"Olimpia Mila"},{"$f":"'Betistuta MS'!D67","v":"62-66"},{"$f":"SEARCH(\"-\",F16)","v":3},{"$f":"LEFT(F16,G16-1)*1","v":62},{"$f":"MID(F16,G16+1,4)*1","v":66},{"$f":"IF(OR(H16=\"\",I16=\"\"),\"\",IF(D16=$A$15,H16,I16))","v":66},{"$f":"IF(OR(H16=\"\",I16=\"\"),\"\",IF(D16=$A$15,I16,H16))","v":62},{"$f":"IF(OR(J16=\"\",K16=\"\"),\"\",IF(J16>K16,3,IF(J16<K16,0,1)))","v":3},{"$f":"IF(L16=\"\",\"\",IF(L16=3,1,IF(L16=1,0.5,IF(L16=0,0))))","v":1},{"$f":"IF(L16=\"\",\"\",IF(L16=1,\"D\",IF(L16=0,\"L\",IF(L16=3,\"W\"))))","v":"W"},{"$f":"IF(OR(J16=\"\",K16=\"\"),\"\",J16-K16)","v":4},{"$f":"IF(OR(H16=\"\",I16=\"\"),\"\",H16+I16)","v":128},1,{"$f":"IF(E16=$A$15,D16,\"-\")","v":"Virtus Bolog"},{"$f":"IF(E16=$A$15,E16,\"-\")","v":"Olimpia Mila"},{"$f":"IFERROR(IF(AND(R16=D16,S16=E16),F16,\"-\"),\"\")","v":"62-66"},{"$f":"IFERROR(SEARCH(\"-\",T16),\"\")","v":3},{"$f":"IFERROR(LEFT(T16,U16-1)*1,\"\")","v":62},{"$f":"IFERROR(MID(T16,U16+1,4)*1,\"\")","v":66},{"$f":"IFERROR(V16,\"\")","v":62},{"$f":"IFERROR(W16,\"\")","v":66},{"$f":"IF(OR(X16=\"\",Y16=\"\"),\"\",Y16)","v":66},{"$f":"IF(OR(X16=\"\",Y16=\"\"),\"\",X16)","v":62},{"$f":"IF(OR(Z16=\"\",AA16=\"\"),\"\",IF(Z16>AA16,3,IF(Z16<AA16,0,1)))","v":3},{"$f":"IF(AB16=\"\",\"\",IF(AB16=3,1,IF(AB16=1,0.5,IF(AB16=0,0))))","v":1},{"$f":"IF(AB16=\"\",\"\",IF(AB16=1,\"D\",IF(AB16=0,\"L\",IF(AB16=3,\"W\"))))","v":"W"},{"$f":"IF(OR(Z16=\"\",AA16=\"\"),\"\",Z16-AA16)","v":4},{"$f":"IFERROR(SUM(Z16:AA16),\"\")","v":128},{"$f":"COUNT(X16:X25)","v":5},{"$f":"COUNT(H16:H25)","v":10},"Oynanan Maç Sayısı",{"$f":"AJ2","v":1},{"$f":"J25","v":92},{"$f":"K25","v":87}]
[{"$f":"1+A16","v":2},{"$f":"'Betistuta MS'!B68","v":"2022-06-01"},{"$f":"'Betistuta MS'!A68","v":"D"},{"$f":"'Betistuta MS'!C68","v":"Sassari"},{"$f":"'Betistuta MS'!E68","v":"Olimpia Mila"},{"$f":"'Betistuta MS'!D68","v":"69-87"},3,69,87,87,69,{"$f":"IF(OR(J17=\"\",K17=\"\"),\"\",IF(J17>K17,3,IF(J17<K17,0,1)))","v":3},{"$f":"IF(L17=\"\",\"\",IF(L17=3,1,IF(L17=1,0.5,IF(L17=0,0))))","v":1},{"$f":"IF(L17=\"\",\"\",IF(L17=1,\"D\",IF(L17=0,\"L\",IF(L17=3,\"W\"))))","v":"W"},18,156,{"$f":"1+Q16","v":2},"Sassari","Olimpia Mila","69-87",{"$f":"IFERROR(SEARCH(\"-\",T17),\"\")","v":3},{"$f":"IFERROR(LEFT(T17,U17-1)*1,\"\")","v":69},{"$f":"IFERROR(MID(T17,U17+1,4)*1,\"\")","v":87},{"$f":"IFERROR(V17,\"\")","v":69},87,{"$f":"IF(OR(X17=\"\",Y17=\"\"),\"\",Y17)","v":87},{"$f":"IF(OR(X17=\"\",Y17=\"\"),\"\",X17)","v":69},{"$f":"IF(OR(Z17=\"\",AA17=\"\"),\"\",IF(Z17>AA17,3,IF(Z17<AA17,0,1)))","v":3},{"$f":"IF(AB17=\"\",\"\",IF(AB17=3,1,IF(AB17=1,0.5,IF(AB17=0,0))))","v":1},{"$f":"IF(AB17=\"\",\"\",IF(AB17=1,\"D\",IF(AB17=0,\"L\",IF(AB17=3,\"W\"))))","v":"W"},{"$f":"IF(OR(Z17=\"\",AA17=\"\"),\"\",Z17-AA17)","v":18},{"$f":"IFERROR(SUM(Z17:AA17),\"\")","v":156},{"$f":"SUM(Z16:Z25)","v":390},{"$f":"SUM(J16:J25)","v":843},"Attıkları Basket Sayısı",2,{"$f":"J24","v":74},{"$f":"K24","v":80}]
[{"$f":"1+A17","v":3},{"$f":"'Betistuta MS'!B69","v":"2022-05-30"},{"$f":"'Betistuta MS'!A69","v":"D"},{"$f":"'Betistuta MS'!C69","v":"Olimpia Mila"},{"$f":"'Betistuta MS'!E69","v":"Sassari"},{"$f":"'Betistuta MS'!D69","v":"91-82"},3,91,82,91,82,3,1,"W",9,173,{"$f":"1+Q17","v":3},"-","-","-",1,"","","","","","","","","","",0,{"$f":"SUM(AA16:AA25)","v":339},{"$f":"SUM(K16:K25)","v":726},"Yedikleri Basket Sayısı",3,{"$f":"J23","v":74},{"$f":"K23","v":69}]
[4,{"$f":"'Betistuta MS'!B70","v":"2022-05-28"},{"$f":"'Betistuta MS'!A70","v":"D"},{"$f":"'Betistuta MS'!C70","v":"Olimpia Mila"},{"$f":"'Betistuta MS'!E70","v":"Sassari"},{"$f":"'Betistuta MS'!D70","v":"88-71"},3,88,71,88,71,3,1,"W",17,159,4,"-","-","-",1,"","","","","","","","","","",0,{"$f":"AG17/AG16","v":78},{"$f":"AH17/AH16","v":84.3},"Attıkları Basket Sayısı Ortalaması",4,{"$f":"J22","v":91},{"$f":"K22","v":82}]
[5,{"$f":"'Betistuta MS'!B71","v":"2022-05-19"},{"$f":"'Betistuta MS'!A71","v":"D"},{"$f":"'Betistuta MS'!C71","v":"Reggiana"},{"$f":"'Betistuta MS'!E71","v":"Olimpia Mila"},{"$f":"'Betistuta MS'!D71","v":"59-89"},3,59,89,89,59,3,1,"W",30,148,5,"Reggiana","Olimpia Mila","59-89",3,59,89,59,89,89,59,3,1,"W",30,148,{"$f":"AG18/AG16","v":67.8},{"$f":"AH18/AH16","v":72.599999999999994},"Yedikleri Basket Sayısı Ortalaması",5,{"$f":"J21","v":91},{"$f":"K21","v":65}]
[6,{"$f":"'Betistuta MS'!B72","v":"2022-05-17"},{"$f":"'Betistuta MS'!A72","v":"D"},{"$f":"'Betistuta MS'!C72","v":"Olimpia Mila"},{"$f":"'Betistuta MS'!E72","v":"Reggiana"},{"$f":"'Betistuta MS'!D72","v":"91-65"},3,91,65,91,65,3,1,"W",26,156,6,"-","-","-",1,"","","","","","","","","","",0,{"$f":"COUNTIF($AD$16:$AD$25,\"W\")/AG16","v":0.8},{"$f":"COUNTIF($N$16:$N$25,\"W\")/AH16","v":0.9},"Galibiyet %",6,{"$f":"J20","v":89},{"$f":"K20","v":59}]
[7,{"$f":"'Betistuta MS'!B73","v":"2022-05-15"},{"$f":"'Betistuta MS'!A73","v":"D"},{"$f":"'Betistuta MS'!C73","v":"Olimpia Mila"},{"$f":"'Betistuta MS'!E73","v":"Reggiana"},{"$f":"'Betistuta MS'!D73","v":"91-82"},3,91,82,91,82,3,1,"W",9,173,7,"-","-","-",1,"","","","","","","","","","",0,{"$f":"COUNTIF($AD$16:$AD$25,\"D\")/AG16","v":0},{"$f":"COUNTIF($N$16:$N$25,\"D\")/AH16","v":0},"Beraberlik %",7,{"$f":"J19","v":88},{"$f":"K19","v":71}]
[8,{"$f":"'Betistuta MS'!B74","v":"2022-05-08"},{"$f":"'Betistuta MS'!A74","v":"D"},{"$f":"'Betistuta MS'!C74","v":"Venezia"},{"$f":"'Betistuta MS'!E74","v":"Olimpia Mila"},{"$f":"'Betistuta MS'!D74","v":"69-74"},3,69,74,74,69,3,1,"W",5,143,8,"Venezia","Olimpia Mila","69-74",3,69,74,69,74,74,69,3,1,"W",5,143,{"$f":"COUNTIF($AD$16:$AD$25,\"L\")/AG16","v":0.2},{"$f":"COUNTIF($N$16:$N$25,\"L\")/AH16","v":0.1},"Mağlubiyet %",8,{"$f":"J18","v":91},{"$f":"K18","v":82}]
[9,{"$f":"'Betistuta MS'!B75","v":"2022-05-04"},{"$f":"'Betistuta MS'!A75","v":"D"},{"$f":"'Betistuta MS'!C75","v":"Treviso"},{"$f":"'Betistuta MS'!E75","v":"Olimpia Mila"},{"$f":"'Betistuta MS'!D75","v":"80-74"},3,80,74,74,80,0,0,"L",-6,154,9,"Treviso","Olimpia Mila","80-74",3,80,74,80,74,74,80,0,0,"L",-6,154,{"$f":"IF(OR(AH21=0,AH23=0),0,(AH21/AH23))","v":9},null,"Skor Olasılıkları",9,{"$f":"J17","v":87},{"$f":"K17","v":69}]
[10,{"$f":"'Betistuta MS'!B76","v":"2022-05-01"},{"$f":"'Betistuta MS'!A76","v":"D"},{"$f":"'Betistuta MS'!C76","v":"Olimpia Mila"},{"$f":"'Betistuta MS'!E76","v":"Brindisi"},{"$f":"'Betistuta MS'!D76","v":"92-87"},3,92,87,92,87,3,1,"W",5,179,10,"-","-","-",1,"","","","","","","","","","",0,{"$f":"IF(OR(AG21=0,AG23=0),0,(AG21/AG23))","v":4},null,"Genel Skor Olasılığı",10,{"$f":"J16","v":66},{"$f":"K16","v":62}]
[null,null,null,null,null,null,null,null,null,null,null,null,null,null,null,null,null,null,null,null,null,null,null,null,null,null,null,null,null,null,null,null,{"$f":"AVERAGE(AG24:AG25)","v":6.5},"DEP",{"$f":"A15","v":"Olimpia Mila"},11,{"$f":"INT(FORECAST(AJ26,AK16:AK25,AJ16:AJ25))","v":82},{"$f":"INT(FORECAST(AJ26,AL16:AL25,AJ16:AJ25))","v":63}]
[null,null,null,null,null,null,null,{"$f":"SUM(H16:H26)","v":792},{"$f":"SUM(I16:I26)","v":777},843,726,null,null,null,{"$f":"SUM(O16:O26)","v":117},{"$f":"SUM(P16:P26)","v":1569},null,null,null,null,null,{"$f":"SUM(V16:V26)","v":339},{"$f":"SUM(W16:W26)","v":390},339,390,390,339,null,null,null,null,{"$f":"SUM(AF16:AF26)","v":729},{"$f":"AI27","v":84.3},null,{"$f":"AH19","v":84.3},"ORT.",{"$f":"INT(AVERAGE(AK16:AK26))","v":84},{"$f":"INT(AVERAGE(AL16:AL26))","v":71}]

{"sheet":"İY","index":7,"n_rows":27,"n_cols":40,"rows_kept":27,"cut":false,"hidden":false,"merged":[[9,38,11,39],[14,0,14,4],[14,7,14,8],[14,16,14,19],[14,21,14,22],[14,23,14,24],[14,35,14,37],[0,35,0,37],[0,0,0,4],[0,7,0,8],[0,16,0,19],[0,21,0,22],[0,23,0,24]]}
[{"$f":"IF(COUNTIF(D2:E11,D2)>COUNTIF(D2:E11,E2),D2,E2)","v":"Virtus Bolog"},null,null,null,null,"SONUÇ","BUL","SONUÇ",null,"TG","GT","PKT","PERF","FORM","FARK","TOPLAM",{"$f":"A1","v":"Virtus Bolog"},null,null,null,"BUL","SONUÇ",null,"SONUÇ",null,"TG","GT","PKT","PERF","FORM","TD","OV","İÇ SAHA","GENEL","İSTATİSTİK","EV SAHİBİ",null,null,{"$f":"AJ1","v":"EV SAHİBİ"},{"$f":"AJ15","v":"DEPLASMAN"}]
[1,{"$f":"'Betistuta MS'!B48","v":"2022-06-08"},{"$f":"'Betistuta MS'!A48","v":"D"},{"$f":"'Betistuta MS'!C48","v":"Virtus Bolog"},{"$f":"'Betistuta MS'!E48","v":"Olimpia Mila"},{"$f":"'Betistuta MS'!F48","v":"27-28"},{"$f":"SEARCH(\"-\",F2)","v":3},{"$f":"LEFT(F2,G2-1)*1","v":27},{"$f":"MID(F2,G2+1,4)*1","v":28},{"$f":"IF(OR(H2=\"\",I2=\"\"),\"\",IF(D2=$A$1,H2,I2))","v":27},{"$f":"IF(OR(H2=\"\",I2=\"\"),\"\",IF(D2=$A$1,I2,H2))","v":28},{"$f":"IF(OR(J2=\"\",K2=\"\"),\"\",IF(J2>K2,3,IF(J2<K2,0,1)))","v":0},{"$f":"IF(L2=\"\",\"\",IF(L2=3,1,IF(L2=1,0.5,IF(L2=0,0))))","v":0},{"$f":"IF(L2=\"\",\"\",IF(L2=1,\"D\",IF(L2=0,\"L\",IF(L2=3,\"W\"))))","v":"L"},{"$f":"IF(OR(J2=\"\",K2=\"\"),\"\",J2-K2)","v":-1},{"$f":"IF(OR(H2=\"\",I2=\"\"),\"\",H2+I2)","v":55},1,{"$f":"IF(D2=$A$1,D2,\"-\")","v":"Virtus Bolog"},{"$f":"IF(D2=$A$1,E2,\"-\")","v":"Olimpia Mila"},{"$f":"IFERROR(IF(AND(R2=D2,S2=E2),F2,\"-\"),\"\")","v":"27-28"},{"$f":"IFERROR(SEARCH(\"-\",T2),\"\")","v":3},{"$f":"IFERROR(LEFT(T2,U2-1)*1,\"\")","v":27},{"$f":"IFERROR(MID(T2,U2+1,4)*1,\"\")","v":28},{"$f":"IFERROR(V2,\"\")","v":27},{"$f":"IFERROR(W2,\"\")","v":28},{"$f":"IF(OR(X2=\"\",Y2=\"\"),\"\",X2)","v":27},{"$f":"IF(OR(X2=\"\",Y2=\"\"),\"\",Y2)","v":28},{"$f":"IF(OR(Z2=\"\",AA2=\"\"),\"\",IF(Z2>AA2,3,IF(Z2<AA2,0,1)))","v":0},{"$f":"IF(AB2=\"\",\"\",IF(AB2=3,1,IF(AB2=1,0.5,IF(AB2=0,0))))","v":0},{"$f":"IF(AB2=\"\",\"\",IF(AB2=1,\"D\",IF(AB2=0,\"L\",IF(AB2=3,\"W\"))))","v":"L"},{"$f":"IF(OR(Z2=\"\",AA2=\"\"),\"\",Z2-AA2)","v":-1},{"$f":"IFERROR(SUM(Z2:AA2),\"\")","v":55},{"$f":"COUNT(X2:X11)","v":7},{"$f":"COUNT(H2:H11)","v":10},"Oynanan Maç Sayısı",1,{"$f":"J11","v":35},{"$f":"K11","v":47},{"$f":"(AK12+AL26)/2","v":33.5},{"$f":"(AL12+AK26)/2","v":36}]
[{"$f":"1+A2","v":2},{"$f":"'Betistuta MS'!B49","v":"2022-05-31"},{"$f":"'Betistuta MS'!A49","v":"D"},{"$f":"'Betistuta MS'!C49","v":"Tortona"},{"$f":"'Betistuta MS'!E49","v":"Virtus Bolog"},{"$f":"'Betistuta MS'!F49","v":"33-47"},3,33,47,47,33,{"$f":"IF(OR(J3=\"\",K3=\"\"),\"\",IF(J3>K3,3,IF(J3<K3,0,1)))","v":3},{"$f":"IF(L3=\"\",\"\",IF(L3=3,1,IF(L3=1,0.5,IF(L3=0,0))))","v":1},{"$f":"IF(L3=\"\",\"\",IF(L3=1,\"D\",IF(L3=0,\"L\",IF(L3=3,\"W\"))))","v":"W"},14,80,{"$f":"1+Q2","v":2},"-","-","-",{"$f":"IFERROR(SEARCH(\"-\",T3),\"\")","v":1},{"$f":"IFERROR(LEFT(T3,U3-1)*1,\"\")","v":""},{"$f":"IFERROR(MID(T3,U3+1,4)*1,\"\")","v":""},{"$f":"IFERROR(V3,\"\")","v":""},"",{"$f":"IF(OR(X3=\"\",Y3=\"\"),\"\",X3)","v":""},{"$f":"IF(OR(X3=\"\",Y3=\"\"),\"\",Y3)","v":""},{"$f":"IF(OR(Z3=\"\",AA3=\"\"),\"\",IF(Z3>AA3,3,IF(Z3<AA3,0,1)))","v":""},{"$f":"IF(AB3=\"\",\"\",IF(AB3=3,1,IF(AB3=1,0.5,IF(AB3=0,0))))","v":""},{"$f":"IF(AB3=\"\",\"\",IF(AB3=1,\"D\",IF(AB3=0,\"L\",IF(AB3=3,\"W\"))))","v":""},{"$f":"IF(OR(Z3=\"\",AA3=\"\"),\"\",Z3-AA3)","v":""},{"$f":"IFERROR(SUM(Z3:AA3),\"\")","v":0},{"$f":"SUM(Z2:Z11)","v":262},{"$f":"SUM(J2:J11)","v":379},"Attıkları Basket Sayısı",2,{"$f":"J10","v":42},{"$f":"K10","v":24},{"$f":"IF(AM2>=7,\"7\",IF(AM2>=6,\"6\",IF(AM2>=5,\"5\",IF(AM2>=4,\"4\",IF(AM2>=3,\"3\",IF(AM2>=2,\"2\",IF(AM2>=1,\"1\",\"0\")))))))","v":"7"},{"$f":"IF(AN2>=7,\"7\",IF(AN2>=6,\"6\",IF(AN2>=5,\"5\",IF(AN2>=4,\"4\",IF(AN2>=3,\"3\",IF(AN2>=2,\"2\",IF(AN2>=1,\"1\",\"0\")))))))","v":"7"}]
[{"$f":"1+A3","v":3},{"$f":"'Betistuta MS'!B50","v":"2022-05-29"},{"$f":"'Betistuta MS'!A50","v":"D"},{"$f":"'Betistuta MS'!C50","v":"Virtus Bolog"},{"$f":"'Betistuta MS'!E50","v":"Tortona"},{"$f":"'Betistuta MS'!F50","v":"41-35"},3,41,35,41,35,3,1,"W",6,76,{"$f":"1+Q3","v":3},"Virtus Bolog","Tortona","41-35",3,{"$f":"IFERROR(LEFT(T4,U4-1)*1,\"\")","v":41},35,41,35,41,35,3,1,"W",6,76,{"$f":"SUM(AA2:AA11)","v":217},{"$f":"SUM(K2:K11)","v":332},"Yedikleri Basket Sayısı",3,{"$f":"J9","v":41},{"$f":"K9","v":31},{"$f":"ROUNDDOWN(AM2+AN3/2+1,0)","v":38},{"$f":"ROUNDDOWN(AN2+AM3/2+1,0)","v":40}]
[4,{"$f":"'Betistuta MS'!B51","v":"2022-05-27"},{"$f":"'Betistuta MS'!A51","v":"D"},{"$f":"'Betistuta MS'!C51","v":"Virtus Bolog"},{"$f":"'Betistuta MS'!E51","v":"Tortona"},{"$f":"'Betistuta MS'!F51","v":"35-38"},3,35,38,35,38,0,0,"L",-3,73,4,"Virtus Bolog","Tortona","35-38",3,{"$f":"IFERROR(LEFT(T5,U5-1)*1,\"\")","v":35},38,35,38,35,38,0,0,"L",-3,73,{"$f":"AG3/AG2","v":37.428571428571431},{"$f":"AH3/AH2","v":37.9},"Attıkları Basket Sayısı Ortalaması",4,{"$f":"J8","v":45},{"$f":"K8","v":36},{"$f":"AM4-AN4","v":-2},{"$f":"AM2+AN2","v":69.5}]
[5,{"$f":"'Betistuta MS'!B52","v":"2022-05-19"},{"$f":"'Betistuta MS'!A52","v":"D"},{"$f":"'Betistuta MS'!C52","v":"Pesaro"},{"$f":"'Betistuta MS'!E52","v":"Virtus Bolog"},{"$f":"'Betistuta MS'!F52","v":"35-35"},3,35,35,35,35,1,0.5,"D",0,70,5,"-","-","-",1,"","","","","","","","","","",0,{"$f":"AG4/AG2","v":31},{"$f":"AH4/AH2","v":33.200000000000003},"Yedikleri Basket Sayısı Ortalaması",5,{"$f":"J7","v":31},{"$f":"K7","v":25},{"$f":"CONCATENATE(AM4,\" : \",AN4)","v":"38 : 40"},{"$f":"AM4+AN4","v":78}]
[6,{"$f":"'Betistuta MS'!B53","v":"2022-05-17"},{"$f":"'Betistuta MS'!A53","v":"D"},{"$f":"'Betistuta MS'!C53","v":"Virtus Bolog"},{"$f":"'Betistuta MS'!E53","v":"Pesaro"},{"$f":"'Betistuta MS'!F53","v":"31-25"},3,31,25,31,25,3,1,"W",6,56,6,"Virtus Bolog","Pesaro","31-25",3,31,25,31,25,31,25,3,1,"W",6,56,{"$f":"COUNTIF($AD$2:$AD$11,\"W\")/AG2","v":0.7142857142857143},{"$f":"COUNTIF($N$2:$N$11,\"W\")/AH2","v":0.6},"Galibiyet %",6,{"$f":"J6","v":35},{"$f":"K6","v":35},178.5,{"$f":"SUBSTITUTE(AM7,\",\",\".\")","v":"178.5"}]
[7,{"$f":"'Betistuta MS'!B54","v":"2022-05-15"},{"$f":"'Betistuta MS'!A54","v":"D"},{"$f":"'Betistuta MS'!C54","v":"Virtus Bolog"},{"$f":"'Betistuta MS'!E54","v":"Pesaro"},{"$f":"'Betistuta MS'!F54","v":"45-36"},3,45,36,45,36,3,1,"W",9,81,7,"Virtus Bolog","Pesaro","45-36",3,45,36,45,36,45,36,3,1,"W",9,81,{"$f":"COUNTIF($AD$2:$AD$11,\"D\")/AG2","v":0},{"$f":"COUNTIF($N$2:$N$11,\"D\")/AH2","v":0.1},"Beraberlik %",7,{"$f":"J5","v":35},{"$f":"K5","v":38},170.5,{"$f":"SUBSTITUTE(AM8+4,\",\",\".\")","v":"174.5"}]
[8,{"$f":"'Betistuta MS'!B55","v":"2022-05-11"},{"$f":"'Betistuta MS'!A55","v":"D"},{"$f":"'Betistuta MS'!C55","v":"Virtus Bolog"},{"$f":"'Betistuta MS'!E55","v":"Bursaspor"},{"$f":"'Betistuta MS'!F55","v":"41-31"},3,41,31,41,31,3,1,"W",10,72,8,"Virtus Bolog","Bursaspor","41-31",3,41,31,41,31,41,31,3,1,"W",10,72,{"$f":"COUNTIF($AD$2:$AD$11,\"L\")/AG2","v":0.2857142857142857},{"$f":"COUNTIF($N$2:$N$11,\"L\")/AH2","v":0.3},"Mağlubiyet %",8,{"$f":"J4","v":41},{"$f":"K4","v":35},{"$f":"CONCATENATE(\"TOPLAM : \",AN8,\" \",AN9)","v":"TOPLAM : 174.5 ALT"},"ALT"]
[9,{"$f":"'Betistuta MS'!B56","v":"2022-05-08"},{"$f":"'Betistuta MS'!A56","v":"D"},{"$f":"'Betistuta MS'!C56","v":"Virtus Bolog"},{"$f":"'Betistuta MS'!E56","v":"Brescia"},{"$f":"'Betistuta MS'!F56","v":"42-24"},3,42,24,42,24,3,1,"W",18,66,9,"Virtus Bolog","Brescia","42-24",3,42,24,42,24,42,24,3,1,"W",18,66,{"$f":"IF(OR(AH7=0,AH9=0),0,(AH7/AH9))","v":2},null,"Skor Olasılıkları",9,{"$f":"J3","v":47},{"$f":"K3","v":33},{"$f":"CONCATENATE(\"BEN SADECE TOPLAM SAYIYA BAKARAK OYNUYORUM\",\" \",\"MS-TOP.SAYI: \",AN6)","v":"BEN SADECE TOPLAM SAYIYA BAKARAK OYNUYORUM MS-TOP.SAYI: 78"}]
[10,{"$f":"'Betistuta MS'!B57","v":"2022-05-06"},{"$f":"'Betistuta MS'!A57","v":"D"},{"$f":"'Betistuta MS'!C57","v":"Sassari"},{"$f":"'Betistuta MS'!E57","v":"Virtus Bolog"},{"$f":"'Betistuta MS'!F57","v":"47-35"},3,47,35,35,47,0,0,"L",-12,82,10,"-","-","-",1,"","","","","","","","","","",0,{"$f":"IF(OR(AG7=0,AG9=0),0,(AG7/AG9))","v":2.5},null,"Genel Skor Olasılığı",10,{"$f":"J2","v":27},{"$f":"K2","v":28}]
[null,null,null,null,null,null,null,null,null,null,null,null,null,null,null,null,null,null,null,null,null,null,null,null,null,null,null,null,null,null,null,null,{"$f":"AVERAGE(AG10:AG11)","v":2.25},"EV",{"$f":"A1","v":"Virtus Bolog"},11,{"$f":"INT(FORECAST(AJ12,AK2:AK11,AJ2:AJ11))","v":35},{"$f":"INT(FORECAST(AJ12,AL2:AL11,AJ2:AJ11))","v":30}]
[null,null,null,null,null,null,null,{"$f":"SUM(H2:H12)","v":377},{"$f":"SUM(I2:I12)","v":334},379,332,null,null,null,{"$f":"SUM(O2:O12)","v":47},{"$f":"SUM(P2:P12)","v":711},null,null,null,null,null,{"$f":"SUM(V2:V12)","v":262},{"$f":"SUM(W2:W12)","v":217},262,217,262,217,null,null,null,null,{"$f":"SUM(AF2:AF12)","v":479},{"$f":"AI13","v":37.9},null,{"$f":"AH5","v":37.9},"ORT.",{"$f":"INT(AVERAGE(AK2:AK12))","v":37},{"$f":"INT(AVERAGE(AL2:AL12))","v":32},{"$f":"AN4-2","v":38},{"$f":"AM4-2","v":36}]
[]
[{"$f":"IF(COUNTIF(D16:E25,D16)>COUNTIF(D16:E25,E16),D16,E16)","v":"Olimpia Mila"},null,null,null,null,"SONUÇ","BUL","SONUÇ",null,"TG","GT","PKT","PERF","Form","FARK","TOPLAM",{"$f":"A15","v":"Olimpia Mila"},null,null,null,"BUL","SONUÇ",null,"SONUÇ",null,"TG","GT","PKT","PERF","FORM","TD","OV","İÇ SAHA","GENEL","İSTATİSTİK","DEPLASMAN"]
[1,{"$f":"'Betistuta MS'!B67","v":"2022-06-08"},{"$f":"'Betistuta MS'!A67","v":"D"},{"$f":"'Betistuta MS'!C67","v":"Virtus Bolog"},{"$f":"'Betistuta MS'!E67","v":"Olimpia Mila"},{"$f":"'Betistuta MS'!F67","v":"27-28"},{"$f":"SEARCH(\"-\",F16)","v":3},{"$f":"LEFT(F16,G16-1)*1","v":27},{"$f":"MID(F16,G16+1,4)*1","v":28},{"$f":"IF(OR(H16=\"\",I16=\"\"),\"\",IF(D16=$A$15,H16,I16))","v":28},{"$f":"IF(OR(H16=\"\",I16=\"\"),\"\",IF(D16=$A$15,I16,H16))","v":27},{"$f":"IF(OR(J16=\"\",K16=\"\"),\"\",IF(J16>K16,3,IF(J16<K16,0,1)))","v":3},{"$f":"IF(L16=\"\",\"\",IF(L16=3,1,IF(L16=1,0.5,IF(L16=0,0))))","v":1},{"$f":"IF(L16=\"\",\"\",IF(L16=1,\"D\",IF(L16=0,\"L\",IF(L16=3,\"W\"))))","v":"W"},{"$f":"IF(OR(J16=\"\",K16=\"\"),\"\",J16-K16)","v":1},{"$f":"IF(OR(H16=\"\",I16=\"\"),\"\",H16+I16)","v":55},1,{"$f":"IF(E16=$A$15,D16,\"-\")","v":"Virtus Bolog"},{"$f":"IF(E16=$A$15,E16,\"-\")","v":"Olimpia Mila"},{"$f":"IFERROR(IF(AND(R16=D16,S16=E16),F16,\"-\"),\"\")","v":"27-28"},{"$f":"IFERROR(SEARCH(\"-\",T16),\"\")","v":3},{"$f":"IFERROR(LEFT(T16,U16-1)*1,\"\")","v":27},{"$f":"IFERROR(MID(T16,U16+1,4)*1,\"\")","v":28},{"$f":"IFERROR(V16,\"\")","v":27},{"$f":"IFERROR(W16,\"\")","v":28},{"$f":"IF(OR(X16=\"\",Y16=\"\"),\"\",Y16)","v":28},{"$f":"IF(OR(X16=\"\",Y16=\"\"),\"\",X16)","v":27},{"$f":"IF(OR(Z16=\"\",AA16=\"\"),\"\",IF(Z16>AA16,3,IF(Z16<AA16,0,1)))","v":3},{"$f":"IF(AB16=\"\",\"\",IF(AB16=3,1,IF(AB16=1,0.5,IF(AB16=0,0))))","v":1},{"$f":"IF(AB16=\"\",\"\",IF(AB16=1,\"D\",IF(AB16=0,\"L\",IF(AB16=3,\"W\"))))","v":"W"},{"$f":"IF(OR(Z16=\"\",AA16=\"\"),\"\",Z16-AA16)","v":1},{"$f":"IFERROR(SUM(Z16:AA16),\"\")","v":55},{"$f":"COUNT(X16:X25)","v":5},{"$f":"COUNT(H16:H25)","v":10},"Oynanan Maç Sayısı",{"$f":"AJ2","v":1},{"$f":"J25","v":44},{"$f":"K25","v":50}]
[{"$f":"1+A16","v":2},{"$f":"'Betistuta MS'!B68","v":"2022-06-01"},{"$f":"'Betistuta MS'!A68","v":"D"},{"$f":"'Betistuta MS'!C68","v":"Sassari"},{"$f":"'Betistuta MS'!E68","v":"Olimpia Mila"},{"$f":"'Betistuta MS'!F68","v":"34-47"},3,34,47,47,34,{"$f":"IF(OR(J17=\"\",K17=\"\"),\"\",IF(J17>K17,3,IF(J17<K17,0,1)))","v":3},{"$f":"IF(L17=\"\",\"\",IF(L17=3,1,IF(L17=1,0.5,IF(L17=0,0))))","v":1},{"$f":"IF(L17=\"\",\"\",IF(L17=1,\"D\",IF(L17=0,\"L\",IF(L17=3,\"W\"))))","v":"W"},13,81,{"$f":"1+Q16","v":2},"Sassari","Olimpia Mila","34-47",{"$f":"IFERROR(SEARCH(\"-\",T17),\"\")","v":3},{"$f":"IFERROR(LEFT(T17,U17-1)*1,\"\")","v":34},{"$f":"IFERROR(MID(T17,U17+1,4)*1,\"\")","v":47},{"$f":"IFERROR(V17,\"\")","v":34},47,{"$f":"IF(OR(X17=\"\",Y17=\"\"),\"\",Y17)","v":47},{"$f":"IF(OR(X17=\"\",Y17=\"\"),\"\",X17)","v":34},{"$f":"IF(OR(Z17=\"\",AA17=\"\"),\"\",IF(Z17>AA17,3,IF(Z17<AA17,0,1)))","v":3},{"$f":"IF(AB17=\"\",\"\",IF(AB17=3,1,IF(AB17=1,0.5,IF(AB17=0,0))))","v":1},{"$f":"IF(AB17=\"\",\"\",IF(AB17=1,\"D\",IF(AB17=0,\"L\",IF(AB17=3,\"W\"))))","v":"W"},{"$f":"IF(OR(Z17=\"\",AA17=\"\"),\"\",Z17-AA17)","v":13},{"$f":"IFERROR(SUM(Z17:AA17),\"\")","v":81},{"$f":"SUM(Z16:Z25)","v":182},{"$f":"SUM(J16:J25)","v":425},"Attıkları Basket Sayısı",2,{"$f":"J24","v":32},{"$f":"K24","v":29}]
[{"$f":"1+A17","v":3},{"$f":"'Betistuta MS'!B69","v":"2022-05-30"},{"$f":"'Betistuta MS'!A69","v":"D"},{"$f":"'Betistuta MS'!C69","v":"Olimpia Mila"},{"$f":"'Betistuta MS'!E69","v":"Sassari"},{"$f":"'Betistuta MS'!F69","v":"41-49"},3,41,49,41,49,0,0,"L",-8,90,{"$f":"1+Q17","v":3},"-","-","-",1,"","","","","","","","","","",0,{"$f":"SUM(AA16:AA25)","v":158},{"$f":"SUM(K16:K25)","v":371},"Yedikleri Basket Sayısı",3,{"$f":"J23","v":32},{"$f":"K23","v":41}]
[4,{"$f":"'Betistuta MS'!B70","v":"2022-05-28"},{"$f":"'Betistuta MS'!A70","v":"D"},{"$f":"'Betistuta MS'!C70","v":"Olimpia Mila"},{"$f":"'Betistuta MS'!E70","v":"Sassari"},{"$f":"'Betistuta MS'!F70","v":"50-42"},3,50,42,50,42,3,1,"W",8,92,4,"-","-","-",1,"","","","","","","","","","",0,{"$f":"AG17/AG16","v":36.4},{"$f":"AH17/AH16","v":42.5},"Attıkları Basket Sayısı Ortalaması",4,{"$f":"J22","v":51},{"$f":"K22","v":40}]
[5,{"$f":"'Betistuta MS'!B71","v":"2022-05-19"},{"$f":"'Betistuta MS'!A71","v":"D"},{"$f":"'Betistuta MS'!C71","v":"Reggiana"},{"$f":"'Betistuta MS'!E71","v":"Olimpia Mila"},{"$f":"'Betistuta MS'!F71","v":"27-43"},3,27,43,43,27,3,1,"W",16,70,5,"Reggiana","Olimpia Mila","27-43",3,27,43,27,43,43,27,3,1,"W",16,70,{"$f":"AG18/AG16","v":31.6},{"$f":"AH18/AH16","v":37.1},"Yedikleri Basket Sayısı Ortalaması",5,{"$f":"J21","v":57},{"$f":"K21","v":32}]
[6,{"$f":"'Betistuta MS'!B72","v":"2022-05-17"},{"$f":"'Betistuta MS'!A72","v":"D"},{"$f":"'Betistuta MS'!C72","v":"Olimpia Mila"},{"$f":"'Betistuta MS'!E72","v":"Reggiana"},{"$f":"'Betistuta MS'!F72","v":"57-32"},3,57,32,57,32,3,1,"W",25,89,6,"-","-","-",1,"","","","","","","","","","",0,{"$f":"COUNTIF($AD$16:$AD$25,\"W\")/AG16","v":0.8},{"$f":"COUNTIF($N$16:$N$25,\"W\")/AH16","v":0.7},"Galibiyet %",6,{"$f":"J20","v":43},{"$f":"K20","v":27}]
[7,{"$f":"'Betistuta MS'!B73","v":"2022-05-15"},{"$f":"'Betistuta MS'!A73","v":"D"},{"$f":"'Betistuta MS'!C73","v":"Olimpia Mila"},{"$f":"'Betistuta MS'!E73","v":"Reggiana"},{"$f":"'Betistuta MS'!F73","v":"51-40"},3,51,40,51,40,3,1,"W",11,91,7,"-","-","-",1,"","","","","","","","","","",0,{"$f":"COUNTIF($AD$16:$AD$25,\"D\")/AG16","v":0},{"$f":"COUNTIF($N$16:$N$25,\"D\")/AH16","v":0},"Beraberlik %",7,{"$f":"J19","v":50},{"$f":"K19","v":42}]
[8,{"$f":"'Betistuta MS'!B74","v":"2022-05-08"},{"$f":"'Betistuta MS'!A74","v":"D"},{"$f":"'Betistuta MS'!C74","v":"Venezia"},{"$f":"'Betistuta MS'!E74","v":"Olimpia Mila"},{"$f":"'Betistuta MS'!F74","v":"41-32"},3,41,32,32,41,0,0,"L",-9,73,8,"Venezia","Olimpia Mila","41-32",3,41,32,41,32,32,41,0,0,"L",-9,73,{"$f":"COUNTIF($AD$16:$AD$25,\"L\")/AG16","v":0.2},{"$f":"COUNTIF($N$16:$N$25,\"L\")/AH16","v":0.3},"Mağlubiyet %",8,{"$f":"J18","v":41},{"$f":"K18","v":49}]
[9,{"$f":"'Betistuta MS'!B75","v":"2022-05-04"},{"$f":"'Betistuta MS'!A75","v":"D"},{"$f":"'Betistuta MS'!C75","v":"Treviso"},{"$f":"'Betistuta MS'!E75","v":"Olimpia Mila"},{"$f":"'Betistuta MS'!F75","v":"29-32"},3,29,32,32,29,3,1,"W",3,61,9,"Treviso","Olimpia Mila","29-32",3,29,32,29,32,32,29,3,1,"W",3,61,{"$f":"IF(OR(AH21=0,AH23=0),0,(AH21/AH23))","v":2.3333333333333335},null,"Skor Olasılıkları",9,{"$f":"J17","v":47},{"$f":"K17","v":34}]
[10,{"$f":"'Betistuta MS'!B76","v":"2022-05-01"},{"$f":"'Betistuta MS'!A76","v":"D"},{"$f":"'Betistuta MS'!C76","v":"Olimpia Mila"},{"$f":"'Betistuta MS'!E76","v":"Brindisi"},{"$f":"'Betistuta MS'!F76","v":"44-50"},3,44,50,44,50,0,0,"L",-6,94,10,"-","-","-",1,"","","","","","","","","","",0,{"$f":"IF(OR(AG21=0,AG23=0),0,(AG21/AG23))","v":4},null,"Genel Skor Olasılığı",10,{"$f":"J16","v":28},{"$f":"K16","v":27}]
[null,null,null,null,null,null,null,null,null,null,null,null,null,null,null,null,null,null,null,null,null,null,null,null,null,null,null,null,null,null,null,null,{"$f":"AVERAGE(AG24:AG25)","v":3.166666666666667},"DEP",{"$f":"A15","v":"Olimpia Mila"},11,{"$f":"INT(FORECAST(AJ26,AK16:AK25,AJ16:AJ25))","v":42},{"$f":"INT(FORECAST(AJ26,AL16:AL25,AJ16:AJ25))","v":32}]
[null,null,null,null,null,null,null,{"$f":"SUM(H16:H26)","v":401},{"$f":"SUM(I16:I26)","v":395},425,371,null,null,null,{"$f":"SUM(O16:O26)","v":54},{"$f":"SUM(P16:P26)","v":796},null,null,null,null,null,{"$f":"SUM(V16:V26)","v":158},{"$f":"SUM(W16:W26)","v":182},158,182,182,158,null,null,null,null,{"$f":"SUM(AF16:AF26)","v":340},{"$f":"AI27","v":42.5},null,{"$f":"AH19","v":42.5},"ORT.",{"$f":"INT(AVERAGE(AK16:AK26))","v":42},{"$f":"INT(AVERAGE(AL16:AL26))","v":36}]

{"sheet":"Most","index":8,"n_rows":28,"n_cols":23,"rows_kept":28,"cut":false,"hidden":false,"merged":[[14,13,14,14],[14,15,14,16],[14,19,14,20],[14,21,14,22],[15,13,21,14],[15,15,21,16],[18,17,19,18],[20,17,21,18],[15,19,21,20],[15,21,21,22]]}
[null,"Tarih","Ev Sahibi","MS","Deplasman","İY",null,"Tarih","Ev Sahibi","MS","Deplasman","İY",null,"EV","DEP","EV","DEP","EV","DEP","EV","DEP","EV","DEP"]
[{"$f":"'Betistuta MS'!A48","v":"D"},{"$f":"'Betistuta MS'!B48","v":"2022-06-08"},{"$f":"'Betistuta MS'!C48","v":"Virtus Bolog"},{"$f":"'Betistuta MS'!D48","v":"62-66"},{"$f":"'Betistuta MS'!E48","v":"Olimpia Mila"},{"$f":"'Betistuta MS'!F48","v":"27-28"},{"$f":"'Betistuta MS'!A67","v":"D"},{"$f":"'Betistuta MS'!B67","v":"2022-06-08"},{"$f":"'Betistuta MS'!C67","v":"Virtus Bolog"},{"$f":"'Betistuta MS'!D67","v":"62-66"},{"$f":"'Betistuta MS'!E67","v":"Olimpia Mila"},{"$f":"'Betistuta MS'!F67","v":"27-28"},null,{"$f":"E18/15","v":40.799999999999997},{"$f":"K18/15","v":40.06666666666667},{"$f":"N4+0.02","v":1.1408791208791209},{"$f":"O4+0.02","v":1.1412686567164181},{"$f":"N2*N4","v":45.731868131868133},{"$f":"O2*O4","v":44.925497512437822},{"$f":"MAX(O3,N2)","v":40.799999999999997},{"$f":"MAX(O2,N3)","v":40.06666666666667},{"$f":"MIN(O3,N2)","v":36.4},{"$f":"MIN(O2,N3)","v":35.733333333333334}]
[{"$f":"'Betistuta MS'!A49","v":"D"},{"$f":"'Betistuta MS'!B49","v":"2022-05-31"},{"$f":"'Betistuta MS'!C49","v":"Tortona"},{"$f":"'Betistuta MS'!D49","v":"69-77"},{"$f":"'Betistuta MS'!E49","v":"Virtus Bolog"},{"$f":"'Betistuta MS'!F49","v":"33-47"},{"$f":"'Betistuta MS'!A68","v":"D"},{"$f":"'Betistuta MS'!B68","v":"2022-06-01"},{"$f":"'Betistuta MS'!C68","v":"Sassari"},{"$f":"'Betistuta MS'!D68","v":"69-87"},{"$f":"'Betistuta MS'!E68","v":"Olimpia Mila"},{"$f":"'Betistuta MS'!F68","v":"34-47"},null,{"$f":"F18/15","v":35.733333333333334},{"$f":"L18/15","v":36.4},{"$f":"N4-0.02","v":1.1008791208791209},{"$f":"O4-0.02","v":1.101268656716418},{"$f":"N2*O5","v":36.4},{"$f":"O2*N5","v":35.733333333333334},{"$f":"MAX(N4,O5)","v":1.1208791208791209},{"$f":"MAX(O4,N5)","v":1.1212686567164181},{"$f":"MIN(N4,O5)","v":0.89215686274509809},{"$f":"MIN(O4,N5)","v":0.89184692179700498}]
[{"$f":"'Betistuta MS'!A50","v":"D"},{"$f":"'Betistuta MS'!B50","v":"2022-05-29"},{"$f":"'Betistuta MS'!C50","v":"Virtus Bolog"},{"$f":"'Betistuta MS'!D50","v":"91-70"},{"$f":"'Betistuta MS'!E50","v":"Tortona"},{"$f":"'Betistuta MS'!F50","v":"41-35"},{"$f":"'Betistuta MS'!A69","v":"D"},{"$f":"'Betistuta MS'!B69","v":"2022-05-30"},{"$f":"'Betistuta MS'!C69","v":"Olimpia Mila"},{"$f":"'Betistuta MS'!D69","v":"91-82"},{"$f":"'Betistuta MS'!E69","v":"Sassari"},{"$f":"'Betistuta MS'!F69","v":"41-49"},null,{"$f":"N2/O3","v":1.1208791208791209},{"$f":"O2/N3","v":1.1212686567164181},{"$f":"N5+0.02","v":0.91184692179700499},{"$f":"O5+0.02","v":0.91215686274509811},{"$f":"O3*N4","v":40.799999999999997},{"$f":"N3*O4","v":40.06666666666667},{"$f":"T2*T3","v":45.731868131868133},{"$f":"U2*U3","v":44.925497512437822},{"$f":"V2*V3","v":32.47450980392157},{"$f":"W2*W3","v":31.868663338879646}]
[{"$f":"'Betistuta MS'!A51","v":"D"},{"$f":"'Betistuta MS'!B51","v":"2022-05-27"},{"$f":"'Betistuta MS'!C51","v":"Virtus Bolog"},{"$f":"'Betistuta MS'!D51","v":"77-73"},{"$f":"'Betistuta MS'!E51","v":"Tortona"},{"$f":"'Betistuta MS'!F51","v":"35-38"},{"$f":"'Betistuta MS'!A70","v":"D"},{"$f":"'Betistuta MS'!B70","v":"2022-05-28"},{"$f":"'Betistuta MS'!C70","v":"Olimpia Mila"},{"$f":"'Betistuta MS'!D70","v":"88-71"},{"$f":"'Betistuta MS'!E70","v":"Sassari"},{"$f":"'Betistuta MS'!F70","v":"50-42"},null,{"$f":"N3/O2","v":0.89184692179700498},{"$f":"O3/N2","v":0.89215686274509809},{"$f":"N5-0.02","v":0.87184692179700496},{"$f":"O5-0.02","v":0.87215686274509807},{"$f":"O3*O5","v":32.47450980392157},{"$f":"N3*N5","v":31.868663338879646},{"$f":"T4+1","v":46.731868131868133},{"$f":"U4+1","v":45.925497512437822},{"$f":"V4-2","v":30.47450980392157},{"$f":"W4-2","v":29.868663338879646}]
[{"$f":"'Betistuta MS'!A52","v":"D"},{"$f":"'Betistuta MS'!B52","v":"2022-05-19"},{"$f":"'Betistuta MS'!C52","v":"Pesaro"},{"$f":"'Betistuta MS'!D52","v":"55-75"},{"$f":"'Betistuta MS'!E52","v":"Virtus Bolog"},{"$f":"'Betistuta MS'!F52","v":"35-35"},{"$f":"'Betistuta MS'!A71","v":"D"},{"$f":"'Betistuta MS'!B71","v":"2022-05-19"},{"$f":"'Betistuta MS'!C71","v":"Reggiana"},{"$f":"'Betistuta MS'!D71","v":"59-89"},{"$f":"'Betistuta MS'!E71","v":"Olimpia Mila"},{"$f":"'Betistuta MS'!F71","v":"27-43"},null,{"$f":"SUM(N2:N5)/4","v":19.636514844002367},{"$f":"SUM(O2:O5)/4","v":19.620023046532047},1.006363021338063,1.0067127597307581,{"$f":"ROUND(AVERAGE(R2:R5),0)+1","v":40},{"$f":"ROUND(AVERAGE(S2:S5),0)-1","v":37},"EV",{"$f":"AVERAGE(T5,V5)","v":38.603188967894852},"DEP",{"$f":"AVERAGE(U5,W5)","v":37.897080425658736}]
[{"$f":"'Betistuta MS'!A53","v":"D"},{"$f":"'Betistuta MS'!B53","v":"2022-05-17"},{"$f":"'Betistuta MS'!C53","v":"Virtus Bolog"},{"$f":"'Betistuta MS'!D53","v":"70-51"},{"$f":"'Betistuta MS'!E53","v":"Pesaro"},{"$f":"'Betistuta MS'!F53","v":"31-25"},{"$f":"'Betistuta MS'!A72","v":"D"},{"$f":"'Betistuta MS'!B72","v":"2022-05-17"},{"$f":"'Betistuta MS'!C72","v":"Olimpia Mila"},{"$f":"'Betistuta MS'!D72","v":"91-65"},{"$f":"'Betistuta MS'!E72","v":"Reggiana"},{"$f":"'Betistuta MS'!F72","v":"57-32"}]
[{"$f":"'Betistuta MS'!A54","v":"D"},{"$f":"'Betistuta MS'!B54","v":"2022-05-15"},{"$f":"'Betistuta MS'!C54","v":"Virtus Bolog"},{"$f":"'Betistuta MS'!D54","v":"82-76"},{"$f":"'Betistuta MS'!E54","v":"Pesaro"},{"$f":"'Betistuta MS'!F54","v":"45-36"},{"$f":"'Betistuta MS'!A73","v":"D"},{"$f":"'Betistuta MS'!B73","v":"2022-05-15"},{"$f":"'Betistuta MS'!C73","v":"Olimpia Mila"},{"$f":"'Betistuta MS'!D73","v":"91-82"},{"$f":"'Betistuta MS'!E73","v":"Reggiana"},{"$f":"'Betistuta MS'!F73","v":"51-40"},null,"EV","DEP","EV","DEP","EV","DEP","EV","DEP","EV","DEP"]
[{"$f":"'Betistuta MS'!A55","v":"D"},{"$f":"'Betistuta MS'!B55","v":"2022-05-11"},{"$f":"'Betistuta MS'!C55","v":"Virtus Bolog"},{"$f":"'Betistuta MS'!D55","v":"80-67"},{"$f":"'Betistuta MS'!E55","v":"Bursaspor"},{"$f":"'Betistuta MS'!F55","v":"41-31"},{"$f":"'Betistuta MS'!A74","v":"D"},{"$f":"'Betistuta MS'!B74","v":"2022-05-08"},{"$f":"'Betistuta MS'!C74","v":"Venezia"},{"$f":"'Betistuta MS'!D74","v":"69-74"},{"$f":"'Betistuta MS'!E74","v":"Olimpia Mila"},{"$f":"'Betistuta MS'!F74","v":"41-32"},null,{"$f":"E19/15","v":81.400000000000006},{"$f":"K19/15","v":77.733333333333334},{"$f":"N11+0.02","v":1.1600560224089635},{"$f":"O11+0.02","v":1.1117602996254681},{"$f":"N9*N11","v":92.800560224089637},{"$f":"O9*O11","v":84.866167290886381},{"$f":"MAX(O10,N9)","v":81.400000000000006},{"$f":"MAX(O9,N10)","v":77.733333333333334},{"$f":"MIN(O10,N9)","v":71.400000000000006},{"$f":"MIN(O9,N10)","v":71.2}]
[{"$f":"'Betistuta MS'!A56","v":"D"},{"$f":"'Betistuta MS'!B56","v":"2022-05-08"},{"$f":"'Betistuta MS'!C56","v":"Virtus Bolog"},{"$f":"'Betistuta MS'!D56","v":"79-57"},{"$f":"'Betistuta MS'!E56","v":"Brescia"},{"$f":"'Betistuta MS'!F56","v":"42-24"},{"$f":"'Betistuta MS'!A75","v":"D"},{"$f":"'Betistuta MS'!B75","v":"2022-05-04"},{"$f":"'Betistuta MS'!C75","v":"Treviso"},{"$f":"'Betistuta MS'!D75","v":"80-74"},{"$f":"'Betistuta MS'!E75","v":"Olimpia Mila"},{"$f":"'Betistuta MS'!F75","v":"29-32"},null,{"$f":"F19/15","v":71.2},{"$f":"L19/15","v":71.400000000000006},{"$f":"N11-0.02","v":1.1200560224089635},{"$f":"O11-0.02","v":1.071760299625468},{"$f":"N9*O12","v":71.400000000000006},{"$f":"O9*N12","v":71.2},{"$f":"MAX(N11,O12)","v":1.1400560224089635},{"$f":"MAX(O11,N12)","v":1.0917602996254681},{"$f":"MIN(N11,O12)","v":0.87714987714987713},{"$f":"MIN(O11,N12)","v":0.91595197255574612}]
[{"$f":"'Betistuta MS'!A57","v":"D"},{"$f":"'Betistuta MS'!B57","v":"2022-05-06"},{"$f":"'Betistuta MS'!C57","v":"Sassari"},{"$f":"'Betistuta MS'!D57","v":"108-73"},{"$f":"'Betistuta MS'!E57","v":"Virtus Bolog"},{"$f":"'Betistuta MS'!F57","v":"47-35"},{"$f":"'Betistuta MS'!A76","v":"D"},{"$f":"'Betistuta MS'!B76","v":"2022-05-01"},{"$f":"'Betistuta MS'!C76","v":"Olimpia Mila"},{"$f":"'Betistuta MS'!D76","v":"92-87"},{"$f":"'Betistuta MS'!E76","v":"Brindisi"},{"$f":"'Betistuta MS'!F76","v":"44-50"},null,{"$f":"N9/O10","v":1.1400560224089635},{"$f":"O9/N10","v":1.0917602996254681},{"$f":"N12+0.02","v":0.93595197255574614},{"$f":"O12+0.02","v":0.89714987714987715},{"$f":"O10*N11","v":81.400000000000006},{"$f":"N10*O11","v":77.733333333333334},{"$f":"T9*T10","v":92.800560224089637},{"$f":"U9*U10","v":84.866167290886381},{"$f":"V9*V10","v":62.628501228501236},{"$f":"W9*W10","v":65.215780445969131}]
[{"$f":"'Betistuta MS'!A58","v":"D"},{"$f":"'Betistuta MS'!B58","v":"2022-05-04"},{"$f":"'Betistuta MS'!C58","v":"Valencia"},{"$f":"'Betistuta MS'!D58","v":"73-83"},{"$f":"'Betistuta MS'!E58","v":"Virtus Bolog"},{"$f":"'Betistuta MS'!F58","v":"38-50"},{"$f":"'Betistuta MS'!A77","v":"D"},{"$f":"'Betistuta MS'!B77","v":"2022-04-28"},{"$f":"'Betistuta MS'!C77","v":"Anadolu Efes"},{"$f":"'Betistuta MS'!D77","v":"75-70"},{"$f":"'Betistuta MS'!E77","v":"Olimpia Mila"},{"$f":"'Betistuta MS'!F77","v":"42-43"},null,{"$f":"N10/O9","v":0.91595197255574612},{"$f":"O10/N9","v":0.87714987714987713},{"$f":"N12-0.02","v":0.8959519725557461},{"$f":"O12-0.02","v":0.85714987714987712},{"$f":"O10*O12","v":62.628501228501236},{"$f":"N10*N12","v":65.215780445969131},{"$f":"T11-2","v":90.800560224089637},{"$f":"U11-2","v":82.866167290886381},{"$f":"V11","v":62.628501228501236},{"$f":"W11","v":65.215780445969131}]
[{"$f":"'Betistuta MS'!A59","v":"D"},{"$f":"'Betistuta MS'!B59","v":"2022-04-29"},{"$f":"'Betistuta MS'!C59","v":"Treviso"},{"$f":"'Betistuta MS'!D59","v":"76-113"},{"$f":"'Betistuta MS'!E59","v":"Virtus Bolog"},{"$f":"'Betistuta MS'!F59","v":"34-52"},{"$f":"'Betistuta MS'!A78","v":"D"},{"$f":"'Betistuta MS'!B78","v":"2022-04-26"},{"$f":"'Betistuta MS'!C78","v":"Anadolu Efes"},{"$f":"'Betistuta MS'!D78","v":"77-65"},{"$f":"'Betistuta MS'!E78","v":"Olimpia Mila"},{"$f":"'Betistuta MS'!F78","v":"42-35"},null,{"$f":"SUM(N9:N12)/4","v":38.664001998741185},{"$f":"SUM(O9:O12)/4","v":37.77556087752717},1.0280039974823549,0.98445508838767259,{"$f":"ROUND(AVERAGE(R9:R12),0)+1","v":78},{"$f":"ROUND(AVERAGE(S9:S12),0)-1","v":74},"EV",{"$f":"AVERAGE(T12,V12)","v":76.714530726295436},"DEP",{"$f":"AVERAGE(U12,W12)","v":74.040973868427756}]
[{"$f":"'Betistuta MS'!A60","v":"D"},{"$f":"'Betistuta MS'!B60","v":"2022-04-26"},{"$f":"'Betistuta MS'!C60","v":"Virtus Bolog"},{"$f":"'Betistuta MS'!D60","v":"83-77"},{"$f":"'Betistuta MS'!E60","v":"Ulm"},{"$f":"'Betistuta MS'!F60","v":"43-45"},{"$f":"'Betistuta MS'!A79","v":"D"},{"$f":"'Betistuta MS'!B79","v":"2022-04-23"},{"$f":"'Betistuta MS'!C79","v":"Reggiana"},{"$f":"'Betistuta MS'!D79","v":"63-67"},{"$f":"'Betistuta MS'!E79","v":"Olimpia Mila"},{"$f":"'Betistuta MS'!F79","v":"29-39"}]
[{"$f":"'Betistuta MS'!A61","v":"D"},{"$f":"'Betistuta MS'!B61","v":"2022-04-22"},{"$f":"'Betistuta MS'!C61","v":"Virtus Bolog"},{"$f":"'Betistuta MS'!D61","v":"101-83"},{"$f":"'Betistuta MS'!E61","v":"Tortona"},{"$f":"'Betistuta MS'!F61","v":"49-53"},{"$f":"'Betistuta MS'!A80","v":"D"},{"$f":"'Betistuta MS'!B80","v":"2022-04-21"},{"$f":"'Betistuta MS'!C80","v":"Olimpia Mila"},{"$f":"'Betistuta MS'!D80","v":"73-66"},{"$f":"'Betistuta MS'!E80","v":"Anadolu Efes"},{"$f":"'Betistuta MS'!F80","v":"33-33"},null,{"$f":"UPPER(D22)","v":"VİRTUS BOLOG"},null,{"$f":"UPPER(J22)","v":"OLİMPİA MİLA"},null,"HT","FT",{"$f":"N15","v":"VİRTUS BOLOG"},null,{"$f":"P15","v":"OLİMPİA MİLA"}]
[{"$f":"'Betistuta MS'!A62","v":"D"},{"$f":"'Betistuta MS'!B62","v":"2022-04-20"},{"$f":"'Betistuta MS'!C62","v":"Virtus Bolog"},{"$f":"'Betistuta MS'!D62","v":"75-67"},{"$f":"'Betistuta MS'!E62","v":"Lietkabelis"},{"$f":"'Betistuta MS'!F62","v":"39-34"},{"$f":"'Betistuta MS'!A81","v":"D"},{"$f":"'Betistuta MS'!B81","v":"2022-04-19"},{"$f":"'Betistuta MS'!C81","v":"Olimpia Mila"},{"$f":"'Betistuta MS'!D81","v":"48-64"},{"$f":"'Betistuta MS'!E81","v":"Anadolu Efes"},{"$f":"'Betistuta MS'!F81","v":"26-29"},null,{"$f":"R6+2","v":42},null,{"$f":"S6+2","v":39},null,{"$f":"INT(N16+P16)","v":81},{"$f":"INT(T28+V28)","v":162},{"$f":"INT(V26)","v":78},null,{"$f":"INT(T26)","v":76}]
[null,null,"G","M","AS","YS",null,null,"G","M","AS","YS",null,null,null,null,null,{"$f":"INT(ROUND((V5+W5),2))","v":60},{"$f":"INT(ROUND((V12+W12),2))","v":127}]
["İlk Yarı",null,{"$f":"'Betistuta MS'!B64","v":9},{"$f":"'Betistuta MS'!C64","v":5},{"$f":"'Betistuta MS'!D64","v":612},{"$f":"'Betistuta MS'!E64","v":536},"İlk Yarı",null,{"$f":"'Betistuta MS'!B83","v":9},{"$f":"'Betistuta MS'!C83","v":5},{"$f":"'Betistuta MS'!D83","v":601},{"$f":"'Betistuta MS'!E83","v":546},null,null,null,null,null,{"$f":"INT(ROUND((T5+U5),2))","v":92},{"$f":"INT(ROUND((T12+U12),2))","v":173}]
["Maç Sonu",null,{"$f":"'Betistuta MS'!B65","v":13},{"$f":"'Betistuta MS'!C65","v":2},{"$f":"'Betistuta MS'!D65","v":1221},{"$f":"'Betistuta MS'!E65","v":1068},"Maç Sonu",null,{"$f":"'Betistuta MS'!B84","v":11},{"$f":"'Betistuta MS'!C84","v":4},{"$f":"'Betistuta MS'!D84","v":1166},{"$f":"'Betistuta MS'!E84","v":1071},null,null,null,null,null,{"$f":"CONCATENATE(\"HT: \",L22,\" / \",\"FT: \",L21,\"-\",K21)","v":"HT: 81 / FT: 144,5-ALT"}]
[]
[null,null,null,null,null,null,null,null,null,null,{"$f":"IF(L21>'Betistuta MS'!AA28,\"UST\",\"ALT\")","v":"ALT"},{"$f":"(LARGE(S16:S18,2)+LARGE(S16:S18,3))/2","v":144.5},null,null,null,null,null,{"$f":"IF(AND((N16>P16),(T16>V16)),\"1 / 1\",IF(AND((N16=P16),(T16>V16)),\"X / 1\",IF(AND((N16<P16),(T16>V16)),\"2 / 1\",IF(AND((N16>P16),(T16=V16)),\"1 / X\",IF(AND((N16=P16),(T16=V16)),\"X / X\",IF(AND((N16<P16),(T16=V16)),\"2 / X\",IF(AND((N16>P16),(T16<V16)),\"1 / 2\",IF(AND((N16=P16),(T16<V16)),\"X / 2\",IF(AND((N16<P16),(T16<V16)),\"2 / 2\")))))))))","v":"1 / 1"}]
[null,null,{"$f":"COUNTIF(C2:C16:E2:E16,C2)","v":15},{"$f":"IF(C22>E22,C2,E2)","v":"Virtus Bolog"},{"$f":"COUNTIF(C2:C16:E2:E16,E2)","v":1},null,null,null,{"$f":"COUNTIF(I2:I16:K2:K16,I2)","v":1},{"$f":"IF(I22>K22,I2,K2)","v":"Olimpia Mila"},{"$f":"COUNTIF(I2:I16:K2:K16,K2)","v":15},{"$f":"LARGE(R16:R18,2)","v":81}]
[]
[null,null,null,null,null,null,null,null,null,null,null,{"$f":"(L21/S18)","v":0.83526011560693647},null,null,null,null,null,null,null,{"$f":"T28*L24","v":67.182546744315275},null,{"$f":"L24*V28","v":68.825667492430497}]
[null,null,null,null,null,null,null,null,null,null,null,{"$f":"(T28+V28)/(S16+S17+S18)","v":0.35245316830625106},null,null,null,null,null,null,null,{"$f":"L25*T28/3","v":9.44963172249272},null,{"$f":"L25*V28/3","v":9.68074659827092}]
[null,null,null,null,null,null,null,null,null,null,null,null,null,null,null,null,null,null,null,{"$f":"T24+T25","v":76.632178466808},null,{"$f":"V24+V25","v":78.506414090701412}]
[]
[null,null,null,null,null,null,null,null,null,null,null,null,null,null,null,null,null,null,null,{"$f":"(R13+U12)/2","v":80.43308364544319},null,{"$f":"(S13+T12)/2","v":82.400280112044811}]

{"sheet":"RUS","index":9,"n_rows":15,"n_cols":26,"rows_kept":15,"cut":false,"hidden":false,"merged":[[6,0,6,9],[11,0,11,9],[14,7,14,9]]}
["TAKIM","OYNANAN","W","D","L","ATILAN","YENEN",null,null,null,null,null,null,null,null,null,null,null,null,null,null,null,null,1,{"$f":"C9/B9/(C9/B9+D9/B9+C15/B15+D15/B15)","v":0.72},{"$f":"C2/B2/(C2/B2+D2/B2+D3/B3+C3/B3)","v":0.72727272727272729}]
["EV SAHİBİ",{"$f":"EV!L11","v":10},{"$f":"EV!M11","v":8},{"$f":"EV!N11","v":0},{"$f":"EV!O11","v":2},{"$f":"EV!P11","v":766},{"$f":"EV!Q11","v":692},{"$f":"EV!R11","v":24},{"$f":"F2/B2","v":76.599999999999994},{"$f":"G2/B2","v":69.2},null,null,null,null,null,null,null,null,null,null,null,null,null,"X",{"$f":"(D9/B9+D15/B15)/(C9/B9+D9/B9+C15/B15+D15/B15)","v":0},{"$f":"(D2/B2+D3/B3)/(C2/B2+D2/B2+D3/B3+C3/B3)","v":0}]
["DEPLASMAN",{"$f":"DEP!L11","v":10},{"$f":"DEP!M11","v":3},{"$f":"DEP!N11","v":0},{"$f":"DEP!O11","v":7},{"$f":"DEP!P11","v":773},{"$f":"DEP!Q11","v":796},{"$f":"DEP!R11","v":9},{"$f":"F3/B3","v":77.3},{"$f":"G3/B3","v":79.599999999999994},null,null,null,null,null,null,null,null,null,null,null,null,null,2,{"$f":"C15/B15/(C9/B9+D9/B9+C15/B15+D15/B15)","v":0.27999999999999997},{"$f":"C3/B3/(C2/B2+D2/B2+D3/B3+C3/B3)","v":0.27272727272727271}]
["EV SAHİBİ",{"$f":"EV!W6*1.5+EV!AD6*2","v":649},{"$f":"EV!X6*1.5+EV!AE6","v":437.5},{"$f":"B4/5","v":129.80000000000001},{"$f":"C4/5","v":87.5},{"$f":"((D4+E5)/2+(D5+E4)/2)/2","v":112.175},{"$f":"INT(AVERAGE(I9,I2)+AVERAGE(J5,J3)-F5)","v":81},{"$f":"EV!AF11","v":6},{"$f":"F14/B14","v":75},{"$f":"G14/B14","v":77.333333333333329}]
["DEPLASMAN",{"$f":"DEP!W6*1.5+DEP!AD6*2","v":751},{"$f":"DEP!X6*1.5+DEP!AE6","v":406},{"$f":"B5/5","v":150.19999999999999},{"$f":"C5/5","v":81.2},{"$f":"AVERAGE(EV!J2:K11,DEP!J2:K11)","v":75.674999999999997},{"$f":"INT(AVERAGE(I5,I3)+AVERAGE(J9,J2)-F5)","v":69},{"$f":"DEP!AF11","v":9},{"$f":"F15/B15","v":79},{"$f":"G15/B15","v":81.111111111111114}]
[]
[{"$f":"'Betistuta MS'!A25","v":"Virtus Bologna"}]
["TAKIM","OYNANAN","W","D","L","ATILAN","YENEN"]
["EV SAHİBİ",{"$f":"EV!S11","v":7},{"$f":"EV!T11","v":6},{"$f":"EV!U11","v":0},{"$f":"EV!V11","v":1},{"$f":"EV!W11","v":541},{"$f":"EV!X11","v":460},{"$f":"EV!Y11","v":18},{"$f":"F9/B9","v":77.285714285714292},{"$f":"G9/B9","v":65.714285714285708}]
["DEPLASMAN",{"$f":"DEP!S11","v":1},{"$f":"DEP!T11","v":0},{"$f":"DEP!U11","v":0},{"$f":"DEP!V11","v":1},{"$f":"DEP!W11","v":62},{"$f":"DEP!X11","v":66},{"$f":"DEP!Y11","v":0},{"$f":"F10/B10","v":62},{"$f":"G10/B10","v":66}]
[]
[{"$f":"'Betistuta MS'!A27","v":"Olimpia Milano"}]
["TAKIM","OYNANAN","W","D","L","ATILAN","YENEN","MS1","MSX","MS2"]
["EV SAHİBİ",{"$f":"EV!Z11","v":3},{"$f":"EV!AA11","v":2},{"$f":"EV!AB11","v":0},{"$f":"EV!AC11","v":1},{"$f":"EV!AD11","v":225},{"$f":"EV!AE11","v":232},{"$f":"AVERAGE(Y1,Z1)","v":0.72363636363636363},{"$f":"1-(H14+J14)","v":0},{"$f":"AVERAGE(Y3,Z3)","v":0.27636363636363637}]
["DEPLASMAN",{"$f":"DEP!Z11","v":9},{"$f":"DEP!AA11","v":3},{"$f":"DEP!AB11","v":0},{"$f":"DEP!AC11","v":6},{"$f":"DEP!AD11","v":711},{"$f":"DEP!AE11","v":730},{"$f":"IF('Betistuta MS'!N1>RUS!G4+RUS!G5,\"ÜST\",\"ALT\")","v":"ÜST"}]

{"sheet":"EV","index":10,"n_rows":11,"n_cols":46,"rows_kept":11,"cut":false,"hidden":false,"merged":[[0,1,0,2]]}
[null,{"$f":"IF(D2=D3,D2,IF(D2=E3,D2,E2))","v":"Virtus Bolog"},null,"EV","DEP","EV","DEP","EV - DEP","SONUÇ","SKOR","SKOR","SIRA","W","D","L","EV","DEP","PUAN","OYUN","W","D","L","BERABERE","KAYBETMİŞ","BERABERE","OYUN","W","D","L","SKOR","SKOR","BERABERE",0,1,2,"3+",0,1,2,"3+","SKOR","SKOR","DEĞERLENDİRME","SERİ","TOPLAM","TOPLAM"]
[{"$f":"'Betistuta MS'!C48","v":"Virtus Bolog"},{"$f":"'Betistuta MS'!E48","v":"Olimpia Mila"},{"$f":"'Betistuta MS'!D48","v":"62-66"},{"$f":"A2","v":"Virtus Bolog"},"Olimpia Mila",{"$f":"VALUE(LEFT(C2,FIND(\"-\",C2,1)-1))","v":62},{"$f":"VALUE(LEFT(RIGHT(C2,LEN(C2)-FIND(\"-\",C2,1)),100))","v":66},{"$f":"IF(D2=$B$1,\"EV\",\"DEP\")","v":"EV"},{"$f":"IF(H2=\"EV\",IF(F2>G2,\"W\",IF(F2=G2,\"D\",\"L\")),IF(F2<G2,\"W\",IF(F2=G2,\"D\",\"L\")))","v":"L"},{"$f":"IF(H2=\"EV\",F2,G2)","v":62},{"$f":"IF(H2=\"EV\",G2,F2)","v":66},1,{"$f":"IF(I2=\"W\",1,0)","v":0},{"$f":"IF(I2=\"D\",1,0)","v":0},{"$f":"IF(I2=\"L\",1,0)","v":1},{"$f":"J2","v":62},{"$f":"K2","v":66},{"$f":"M2*3+N2","v":0},{"$f":"IF(H2=\"EV\",1,0)","v":1},{"$f":"IF(H2=\"EV\",IF(I2=\"W\",1,0),0)","v":0},{"$f":"IF(H2=\"EV\",IF(I2=\"D\",1,0),0)","v":0},{"$f":"IF(H2=\"EV\",IF(I2=\"L\",1,0),0)","v":1},{"$f":"IF(H2=\"EV\",J2,0)","v":62},{"$f":"IF(H2=\"EV\",K2,0)","v":66},{"$f":"T2*3+U2","v":0},{"$f":"IF(H2<>\"EV\",1,0)","v":0},{"$f":"IF(H2<>\"EV\",IF(I2=\"W\",1,0),0)","v":0},{"$f":"IF(H2<>\"EV\",IF(I2=\"D\",1,0),0)","v":0},{"$f":"IF(H2<>\"EV\",IF(I2=\"L\",1,0),0)","v":0},{"$f":"IF(H2<>\"EV\",J2,0)","v":0},{"$f":"IF(H2<>\"EV\",K2,0)","v":0},{"$f":"AA2*3+AB2","v":0},{"$f":"IF(H2=\"EV\",IF(J2=0,1,0),0)","v":0},{"$f":"IF(H2=\"EV\",IF(J2=1,1,0),0)","v":0},{"$f":"IF(H2=\"EV\",IF(J2=2,1,0),0)","v":0},{"$f":"IF(H2=\"EV\",IF(J2>=3,1,0),0)","v":1},{"$f":"IF(H2<>\"EV\",IF(J2=0,1,0),0)","v":0},{"$f":"IF(H2<>\"EV\",IF(J2=1,1,0),0)","v":0},{"$f":"IF(H2<>\"EV\",IF(J2=2,1,0),0)","v":0},{"$f":"IF(H2<>\"EV\",IF(J2>=3,1,0),0)","v":0},{"$f":"P2/L2","v":62},{"$f":"Q2/L2","v":66},{"$f":"(Y2/IF(S2<1,1,S2)+AF2/IF(Z2<1,1,Z2)*1.5+W2/IF(S2<1,1,S2)+AD2/IF(Z2<1,1,Z2)*1.5-X2/IF(S2<1,1,S2)*1.5-AE2/IF(Z2<1,1,Z2))/15","v":-2.4666666666666668},{"$f":"IF(H2=\"EV\",IF(I2=\"W\",\"W\",IF(I2=\"D\",\"D\",\"L\")),\"\")","v":"L"},{"$f":"IF(H2=\"EV\",J2+K2,\"\")","v":128},{"$f":"F2+G2","v":128}]
[{"$f":"'Betistuta MS'!C49","v":"Tortona"},{"$f":"'Betistuta MS'!E49","v":"Virtus Bolog"},{"$f":"'Betistuta MS'!D49","v":"69-77"},"Tortona","Virtus Bolog",{"$f":"VALUE(LEFT(C3,FIND(\"-\",C3,1)-1))","v":69},{"$f":"VALUE(LEFT(RIGHT(C3,LEN(C3)-FIND(\"-\",C3,1)),100))","v":77},"DEP",{"$f":"IF(H3=\"EV\",IF(F3>G3,\"W\",IF(F3=G3,\"D\",\"L\")),IF(F3<G3,\"W\",IF(F3=G3,\"D\",\"L\")))","v":"W"},77,69,{"$f":"L2+1","v":2},{"$f":"IF(I3=\"W\",M2+1,M2+0)","v":1},{"$f":"IF(I3=\"D\",N2+1,N2+0)","v":0},{"$f":"IF(I3=\"L\",O2+1,O2+0)","v":1},{"$f":"J3+P2","v":139},{"$f":"K3+Q2","v":135},{"$f":"M3*3+N3","v":3},{"$f":"IF(H3=\"EV\",S2+1,S2+0)","v":1},{"$f":"IF(H3=\"EV\",IF(I3=\"W\",T2+1,T2+0),T2+0)","v":0},{"$f":"IF(H3=\"EV\",IF(I3=\"D\",U2+1,U2+0),U2+0)","v":0},{"$f":"IF(H3=\"EV\",IF(I3=\"L\",V2+1,V2+0),V2+0)","v":1},{"$f":"IF(H3=\"EV\",W2+J3,W2+0)","v":62},{"$f":"IF(H3=\"EV\",X2+K3,X2+0)","v":66},0,{"$f":"IF(H3<>\"EV\",Z2+1,Z2+0)","v":1},{"$f":"IF(H3<>\"EV\",IF(I3=\"W\",AA2+1,AA2+0),AA2+0)","v":1},{"$f":"IF(H3<>\"EV\",IF(I3=\"D\",AB2+1,AB2+0),AB2+0)","v":0},{"$f":"IF(H3<>\"EV\",IF(I3=\"L\",AC2+1,AC2+0),AC2+0)","v":0},{"$f":"IF(H3<>\"EV\",AD2+J3,AD2+0)","v":77},{"$f":"IF(H3<>\"EV\",AE2+K3,AE2+0)","v":69},3,{"$f":"IF(H3=\"EV\",IF(J3=0,AG2+1,AG2),AG2)","v":0},{"$f":"IF(H3=\"EV\",IF(J3=1,AH2+1,AH2),AH2)","v":0},{"$f":"IF(H3=\"EV\",IF(J3=2,AI2+1,AI2),AI2)","v":0},{"$f":"IF(H3=\"EV\",IF(J3>=3,AJ2+1,AJ2),AJ2)","v":1},{"$f":"IF(H3<>\"EV\",IF(J3=0,AK2+1,AK2),AK2)","v":0},{"$f":"IF(H3<>\"EV\",IF(J3=1,AL2+1,AL2),AL2)","v":0},{"$f":"IF(H3<>\"EV\",IF(J3=2,AM2+1,AM2),AM2)","v":0},{"$f":"IF(H3<>\"EV\",IF(J3>=3,AN2+1,AN2),AN2)","v":1},69.5,67.5,{"$f":"(Y3/IF(S3<1,1,S3)+AF3/IF(Z3<1,1,Z3)*1.5+W3/IF(S3<1,1,S3)+AD3/IF(Z3<1,1,Z3)*1.5-X3/IF(S3<1,1,S3)*1.5-AE3/IF(Z3<1,1,Z3))/15","v":0.93333333333333335},"","",{"$f":"F3+G3","v":146}]
[{"$f":"'Betistuta MS'!C50","v":"Virtus Bolog"},{"$f":"'Betistuta MS'!E50","v":"Tortona"},{"$f":"'Betistuta MS'!D50","v":"91-70"},"Virtus Bolog","Tortona",91,70,"EV","W",91,70,{"$f":"L3+1","v":3},2,0,1,{"$f":"J4+P3","v":230},205,6,2,1,0,1,153,136,3,1,1,0,0,77,69,3,0,0,0,2,0,0,0,1,76.666666666666671,68.333333333333329,{"$f":"(Y4/IF(S4<1,1,S4)+AF4/IF(Z4<1,1,Z4)*1.5+W4/IF(S4<1,1,S4)+AD4/IF(Z4<1,1,Z4)*1.5-X4/IF(S4<1,1,S4)*1.5-AE4/IF(Z4<1,1,Z4))/15","v":1.8},"W",161,161]
[{"$f":"'Betistuta MS'!C51","v":"Virtus Bolog"},{"$f":"'Betistuta MS'!E51","v":"Tortona"},{"$f":"'Betistuta MS'!D51","v":"77-73"},"Virtus Bolog","Tortona",77,73,"EV","W",77,73,4,3,0,1,307,278,9,3,2,0,1,230,209,6,1,1,0,0,77,69,3,0,0,0,3,0,0,0,1,76.75,69.5,1.6777777777777791,"W",150,150]
[{"$f":"'Betistuta MS'!C52","v":"Pesaro"},{"$f":"'Betistuta MS'!E52","v":"Virtus Bolog"},{"$f":"'Betistuta MS'!D52","v":"55-75"},"Pesaro","Virtus Bolog",55,75,"DEP","W",75,55,5,4,0,1,382,333,12,3,2,0,1,230,209,6,2,2,0,0,152,124,6,0,0,0,3,0,0,0,2,76.400000000000006,66.599999999999994,2.0444444444444456,"","",130]
[{"$f":"'Betistuta MS'!C53","v":"Virtus Bolog"},{"$f":"'Betistuta MS'!E53","v":"Pesaro"},{"$f":"'Betistuta MS'!D53","v":"70-51"},"Virtus Bolog","Pesaro",70,51,"EV","W",70,51,6,5,0,1,452,384,15,4,3,0,1,300,260,9,2,2,0,0,152,124,6,0,0,0,4,0,0,0,2,75.333333333333329,64,2.4166666666666665,"W",121,121]
[{"$f":"'Betistuta MS'!C54","v":"Virtus Bolog"},{"$f":"'Betistuta MS'!E54","v":"Pesaro"},{"$f":"'Betistuta MS'!D54","v":"82-76"},"Virtus Bolog","Pesaro",82,76,"EV","W",82,76,7,6,0,1,534,460,18,5,4,0,1,382,336,12,2,2,0,0,152,124,6,0,0,0,5,0,0,0,2,76.285714285714292,65.714285714285708,2.2999999999999998,"W",158,158]
[{"$f":"'Betistuta MS'!C55","v":"Virtus Bolog"},{"$f":"'Betistuta MS'!E55","v":"Bursaspor"},{"$f":"'Betistuta MS'!D55","v":"80-67"},"Virtus Bolog","Bursaspor",80,67,"EV","W",80,67,8,7,0,1,614,527,21,6,5,0,1,462,403,15,2,2,0,0,152,124,6,0,0,0,6,0,0,0,2,76.75,65.875,2.35,"W",147,147]
[{"$f":"'Betistuta MS'!C56","v":"Virtus Bolog"},{"$f":"'Betistuta MS'!E56","v":"Brescia"},{"$f":"'Betistuta MS'!D56","v":"79-57"},"Virtus Bolog","Brescia",79,57,"EV","W",79,57,9,8,0,1,693,584,24,7,6,0,1,541,460,18,2,2,0,0,152,124,6,0,0,0,7,0,0,0,2,77,64.888888888888886,2.5190476190476203,"W",136,136]
[{"$f":"'Betistuta MS'!C57","v":"Sassari"},{"$f":"'Betistuta MS'!E57","v":"Virtus Bolog"},{"$f":"'Betistuta MS'!D57","v":"108-73"},"Sassari","Virtus Bolog",108,73,"DEP","L",73,108,10,8,0,2,766,692,24,7,6,0,1,541,460,18,3,2,0,1,225,232,6,0,0,0,7,0,0,0,3,76.599999999999994,69.2,1.2968253968253984,"","",181]

{"sheet":"DEP","index":11,"n_rows":11,"n_cols":46,"rows_kept":11,"cut":false,"hidden":false,"merged":[[0,1,0,2]]}
[null,{"$f":"IF(D2=D3,D2,IF(D2=E3,D2,E2))","v":"Olimpia Mila"},null,"EV","DEP","EV","DEP","EV - DEP","SONUÇ","SKOR","SKOR","SIRA","W","D","L","EV","DEP","PUAN","OYUN","W","D","L","BERABERE","KAYBETMİŞ","BERABERE","OYUN","W","D","L","SKOR","SKOR","BERABERE",0,1,2,"3+",0,1,2,"3+","SKOR","SKOR","DEĞERLENDİRME","SERİ","TOPLAM","TOPLAM"]
[{"$f":"'Betistuta MS'!C67","v":"Virtus Bolog"},{"$f":"'Betistuta MS'!E67","v":"Olimpia Mila"},{"$f":"'Betistuta MS'!D67","v":"62-66"},{"$f":"A2","v":"Virtus Bolog"},"Olimpia Mila",{"$f":"VALUE(LEFT(C2,FIND(\"-\",C2,1)-1))","v":62},{"$f":"VALUE(LEFT(RIGHT(C2,LEN(C2)-FIND(\"-\",C2,1)),100))","v":66},{"$f":"IF(D2=$D$2,\"EV\",\"DEP\")","v":"EV"},{"$f":"IF(H2=\"EV\",IF(F2>G2,\"W\",IF(F2=G2,\"D\",\"L\")),IF(F2<G2,\"W\",IF(F2=G2,\"D\",\"L\")))","v":"L"},{"$f":"IF(H2=\"EV\",F2,G2)","v":62},{"$f":"IF(H2=\"EV\",G2,F2)","v":66},1,{"$f":"IF(I2=\"W\",1,0)","v":0},{"$f":"IF(I2=\"D\",1,0)","v":0},{"$f":"IF(I2=\"L\",1,0)","v":1},{"$f":"J2","v":62},{"$f":"K2","v":66},{"$f":"M2*3+N2","v":0},{"$f":"IF(H2=\"EV\",1,0)","v":1},{"$f":"IF(H2=\"EV\",IF(I2=\"W\",1,0),0)","v":0},{"$f":"IF(H2=\"EV\",IF(I2=\"D\",1,0),0)","v":0},{"$f":"IF(H2=\"EV\",IF(I2=\"L\",1,0),0)","v":1},{"$f":"IF(H2=\"EV\",J2,0)","v":62},{"$f":"IF(H2=\"EV\",K2,0)","v":66},{"$f":"T2*3+U2","v":0},{"$f":"IF(H2<>\"EV\",1,0)","v":0},{"$f":"IF(H2<>\"EV\",IF(I2=\"W\",1,0),0)","v":0},{"$f":"IF(H2<>\"EV\",IF(I2=\"D\",1,0),0)","v":0},{"$f":"IF(H2<>\"EV\",IF(I2=\"L\",1,0),0)","v":0},{"$f":"IF(H2<>\"EV\",J2,0)","v":0},{"$f":"IF(H2<>\"EV\",K2,0)","v":0},{"$f":"AA2*3+AB2","v":0},{"$f":"IF(H2=\"EV\",IF(J2=0,1,0),0)","v":0},{"$f":"IF(H2=\"EV\",IF(J2=1,1,0),0)","v":0},{"$f":"IF(H2=\"EV\",IF(J2=2,1,0),0)","v":0},{"$f":"IF(H2=\"EV\",IF(J2>=3,1,0),0)","v":1},{"$f":"IF(H2<>\"EV\",IF(J2=0,1,0),0)","v":0},{"$f":"IF(H2<>\"EV\",IF(J2=1,1,0),0)","v":0},{"$f":"IF(H2<>\"EV\",IF(J2=2,1,0),0)","v":0},{"$f":"IF(H2<>\"EV\",IF(J2>=3,1,0),0)","v":0},{"$f":"P2/L2","v":62},{"$f":"Q2/L2","v":66},{"$f":"(Y2/IF(S2<1,1,S2)+AF2/IF(Z2<1,1,Z2)*1.5+W2/IF(S2<1,1,S2)+AD2/IF(Z2<1,1,Z2)*1.5-X2/IF(S2<1,1,S2)*1.5-AE2/IF(Z2<1,1,Z2))/15","v":-2.4666666666666668},{"$f":"+IF(H2=\"DEP\",IF(I2=\"W\",\"W\",IF(I2=\"D\",\"D\",\"L\")),\"\")","v":""},{"$f":"IF(H2<>\"EV\",J2+K2,\"\")","v":""},{"$f":"F2+G2","v":128}]
[{"$f":"'Betistuta MS'!C68","v":"Sassari"},{"$f":"'Betistuta MS'!E68","v":"Olimpia Mila"},{"$f":"'Betistuta MS'!D68","v":"69-87"},"Sassari","Olimpia Mila",{"$f":"VALUE(LEFT(C3,FIND(\"-\",C3,1)-1))","v":69},{"$f":"VALUE(LEFT(RIGHT(C3,LEN(C3)-FIND(\"-\",C3,1)),100))","v":87},"DEP","W",87,69,{"$f":"L2+1","v":2},{"$f":"IF(I3=\"W\",M2+1,M2+0)","v":1},{"$f":"IF(I3=\"D\",N2+1,N2+0)","v":0},{"$f":"IF(I3=\"L\",O2+1,O2+0)","v":1},{"$f":"J3+P2","v":149},135,3,{"$f":"IF(H3=\"EV\",S2+1,S2+0)","v":1},{"$f":"IF(H3=\"EV\",IF(I3=\"W\",T2+1,T2+0),T2+0)","v":0},{"$f":"IF(H3=\"EV\",IF(I3=\"D\",U2+1,U2+0),U2+0)","v":0},{"$f":"IF(H3=\"EV\",IF(I3=\"L\",V2+1,V2+0),V2+0)","v":1},{"$f":"IF(H3=\"EV\",W2+J3,W2+0)","v":62},{"$f":"IF(H3=\"EV\",X2+K3,X2+0)","v":66},0,{"$f":"IF(H3<>\"EV\",Z2+1,Z2+0)","v":1},{"$f":"IF(H3<>\"EV\",IF(I3=\"W\",AA2+1,AA2+0),AA2+0)","v":1},{"$f":"IF(H3<>\"EV\",IF(I3=\"D\",AB2+1,AB2+0),AB2+0)","v":0},{"$f":"IF(H3<>\"EV\",IF(I3=\"L\",AC2+1,AC2+0),AC2+0)","v":0},{"$f":"IF(H3<>\"EV\",AD2+J3,AD2+0)","v":87},{"$f":"IF(H3<>\"EV\",AE2+K3,AE2+0)","v":69},3,{"$f":"IF(H3=\"EV\",IF(J3=0,AG2+1,AG2),AG2)","v":0},{"$f":"IF(H3=\"EV\",IF(J3=1,AH2+1,AH2),AH2)","v":0},{"$f":"IF(H3=\"EV\",IF(J3=2,AI2+1,AI2),AI2)","v":0},{"$f":"IF(H3=\"EV\",IF(J3>=3,AJ2+1,AJ2),AJ2)","v":1},{"$f":"IF(H3<>\"EV\",IF(J3=0,AK2+1,AK2),AK2)","v":0},{"$f":"IF(H3<>\"EV\",IF(J3=1,AL2+1,AL2),AL2)","v":0},{"$f":"IF(H3<>\"EV\",IF(J3=2,AM2+1,AM2),AM2)","v":0},{"$f":"IF(H3<>\"EV\",IF(J3>=3,AN2+1,AN2),AN2)","v":1},74.5,{"$f":"Q3/L3","v":67.5},{"$f":"(Y3/IF(S3<1,1,S3)+AF3/IF(Z3<1,1,Z3)*1.5+W3/IF(S3<1,1,S3)+AD3/IF(Z3<1,1,Z3)*1.5-X3/IF(S3<1,1,S3)*1.5-AE3/IF(Z3<1,1,Z3))/15","v":1.9333333333333333},{"$f":"+IF(H3=\"DEP\",IF(I3=\"W\",\"W\",IF(I3=\"D\",\"D\",\"L\")),\"\")","v":"W"},156,{"$f":"F3+G3","v":156}]
[{"$f":"'Betistuta MS'!C69","v":"Olimpia Mila"},{"$f":"'Betistuta MS'!E69","v":"Sassari"},{"$f":"'Betistuta MS'!D69","v":"91-82"},"Olimpia Mila","Sassari",91,82,"DEP","L",82,91,3,1,0,2,231,226,3,1,0,0,1,62,66,0,2,1,0,1,169,160,3,0,0,0,1,0,0,0,2,77,75.333333333333329,0.8,"L",173,173]
[{"$f":"'Betistuta MS'!C70","v":"Olimpia Mila"},{"$f":"'Betistuta MS'!E70","v":"Sassari"},{"$f":"'Betistuta MS'!D70","v":"88-71"},"Olimpia Mila","Sassari",88,71,"DEP","L",71,88,4,1,0,3,302,314,3,1,0,0,1,62,66,0,3,1,0,2,240,248,3,0,0,0,1,0,0,0,3,75.5,78.5,0.12222222222222191,"L",159,159]
[{"$f":"'Betistuta MS'!C71","v":"Reggiana"},{"$f":"'Betistuta MS'!E71","v":"Olimpia Mila"},{"$f":"'Betistuta MS'!D71","v":"59-89"},"Reggiana","Olimpia Mila",59,89,"DEP","W",89,59,5,2,0,3,391,373,6,1,0,0,1,62,66,0,4,2,0,2,329,307,6,0,0,0,1,0,0,0,4,78.2,74.599999999999994,0.79166666666666663,"W",148,148]
[{"$f":"'Betistuta MS'!C72","v":"Olimpia Mila"},{"$f":"'Betistuta MS'!E72","v":"Reggiana"},{"$f":"'Betistuta MS'!D72","v":"91-65"},"Olimpia Mila","Reggiana",91,65,"DEP","L",65,91,6,2,0,4,456,464,6,1,0,0,1,62,66,0,5,2,0,3,394,398,6,0,0,0,1,0,0,0,5,76,77.333333333333329,0.22666666666666704,"L",156,156]
[{"$f":"'Betistuta MS'!C73","v":"Olimpia Mila"},{"$f":"'Betistuta MS'!E73","v":"Reggiana"},{"$f":"'Betistuta MS'!D73","v":"91-82"},"Olimpia Mila","Reggiana",91,82,"DEP","L",82,91,7,2,0,5,538,555,6,1,0,0,1,62,66,0,6,2,0,4,476,489,6,0,0,0,1,0,0,0,6,76.857142857142861,79.285714285714292,0.13333333333333333,"L",173,173]
[{"$f":"'Betistuta MS'!C74","v":"Venezia"},{"$f":"'Betistuta MS'!E74","v":"Olimpia Mila"},{"$f":"'Betistuta MS'!D74","v":"69-74"},"Venezia","Olimpia Mila",69,74,"DEP","W",74,69,8,3,0,5,612,624,9,1,0,0,1,62,66,0,7,3,0,4,550,558,9,0,0,0,1,0,0,0,7,76.5,78,0.20476190476190462,"W",143,143]
[{"$f":"'Betistuta MS'!C75","v":"Treviso"},{"$f":"'Betistuta MS'!E75","v":"Olimpia Mila"},{"$f":"'Betistuta MS'!D75","v":"80-74"},"Treviso","Olimpia Mila",80,74,"DEP","L",74,80,9,3,0,6,686,704,9,1,0,0,1,62,66,0,8,3,0,5,624,638,9,0,0,0,1,0,0,0,8,76.222222222222229,78.222222222222229,0.12916666666666668,"L",154,154]
[{"$f":"'Betistuta MS'!C76","v":"Olimpia Mila"},{"$f":"'Betistuta MS'!E76","v":"Brindisi"},{"$f":"'Betistuta MS'!D76","v":"92-87"},"Olimpia Mila","Brindisi",92,87,"DEP","L",87,92,10,3,0,7,773,796,9,1,0,0,1,62,66,0,9,3,0,6,711,730,9,0,0,0,1,0,0,0,9,77.3,79.599999999999994,0.12592592592592572,"L",179,179]

{"sheet":"0","index":12,"n_rows":15,"n_cols":26,"rows_kept":15,"cut":false,"hidden":false,"merged":[[6,0,6,9],[11,0,11,9],[14,7,14,9]]}
["TAKIM","OYNANAN","W","D","L","ATILAN","YENEN",null,null,null,null,null,null,null,null,null,null,null,null,null,null,null,null,1,{"$f":"C9/B9/(C9/B9+D9/B9+C15/B15+D15/B15)","v":0.5625},{"$f":"C2/B2/(C2/B2+D2/B2+D3/B3+C3/B3)","v":0.5}]
["EV SAHİBİ",{"$f":"'1'!L11","v":10},{"$f":"'1'!M11","v":6},{"$f":"'1'!N11","v":1},{"$f":"'1'!O11","v":3},{"$f":"'1'!P11","v":379},{"$f":"'1'!Q11","v":332},{"$f":"'1'!R11","v":19},{"$f":"F2/B2","v":37.9},{"$f":"G2/B2","v":33.200000000000003},null,null,null,null,null,null,null,null,null,null,null,null,null,"X",{"$f":"(D9/B9+D15/B15)/(C9/B9+D9/B9+C15/B15+D15/B15)","v":0},{"$f":"(D2/B2+D3/B3)/(C2/B2+D2/B2+D3/B3+C3/B3)","v":8.3333333333333343E-2}]
["DEPLASMAN",{"$f":"'2'!L11","v":10},{"$f":"'2'!M11","v":5},{"$f":"'2'!N11","v":0},{"$f":"'2'!O11","v":5},{"$f":"'2'!P11","v":394},{"$f":"'2'!Q11","v":402},{"$f":"'2'!R11","v":15},{"$f":"F3/B3","v":39.4},{"$f":"G3/B3","v":40.200000000000003},null,null,null,null,null,null,null,null,null,null,null,null,null,2,{"$f":"C15/B15/(C9/B9+D9/B9+C15/B15+D15/B15)","v":0.43750000000000006},{"$f":"C3/B3/(C2/B2+D2/B2+D3/B3+C3/B3)","v":0.41666666666666669}]
["EV SAHİBİ",{"$f":"'1'!W6*1.5+'1'!AD6*2","v":318.5},{"$f":"'1'!X6*1.5+'1'!AE6","v":219.5},{"$f":"B4/5","v":63.7},{"$f":"C4/5","v":43.9},{"$f":"((D4+E5)/2+(D5+E4)/2)/2","v":56.725000000000001},{"$f":"INT(AVERAGE(I9,I2)+AVERAGE(J5,J3)-F5)+3","v":43},{"$f":"'1'!AF11","v":4},{"$f":"F14/B14","v":39},{"$f":"G14/B14","v":38.333333333333336}]
["DEPLASMAN",{"$f":"'2'!W6*1.5+'2'!AD6*2","v":402.5},{"$f":"'2'!X6*1.5+'2'!AE6","v":194},{"$f":"B5/5","v":80.5},{"$f":"C5/5","v":38.799999999999997},{"$f":"AVERAGE('1'!J2:K11,'2'!J2:K11)","v":37.674999999999997},{"$f":"INT(AVERAGE(I5,I3)+AVERAGE(J9,J2)-F5)+3","v":37},{"$f":"'2'!AF11","v":15},{"$f":"F15/B15","v":40.777777777777779},{"$f":"G15/B15","v":41.555555555555557}]
[]
[{"$f":"'Betistuta MS'!A25","v":"Virtus Bologna"}]
["TAKIM","OYNANAN","W","D","L","ATILAN","YENEN"]
["EV SAHİBİ",{"$f":"'1'!S11","v":7},{"$f":"'1'!T11","v":5},{"$f":"'1'!U11","v":0},{"$f":"'1'!V11","v":2},{"$f":"'1'!W11","v":262},{"$f":"'1'!X11","v":217},{"$f":"'1'!Y11","v":15},{"$f":"F9/B9","v":37.428571428571431},{"$f":"G9/B9","v":31}]
["DEPLASMAN",{"$f":"'2'!S11","v":1},{"$f":"'2'!T11","v":0},{"$f":"'2'!U11","v":0},{"$f":"'2'!V11","v":1},{"$f":"'2'!W11","v":27},{"$f":"'2'!X11","v":28},{"$f":"'2'!Y11","v":0},{"$f":"F10/B10","v":27},{"$f":"G10/B10","v":28}]
[]
[{"$f":"'Betistuta MS'!A27","v":"Olimpia Milano"}]
["TAKIM","OYNANAN","W","D","L","ATILAN","YENEN","MS1","MSX","MS2"]
["EV SAHİBİ",{"$f":"'1'!Z11","v":3},{"$f":"'1'!AA11","v":1},{"$f":"'1'!AB11","v":1},{"$f":"'1'!AC11","v":1},{"$f":"'1'!AD11","v":117},{"$f":"'1'!AE11","v":115},{"$f":"AVERAGE(Y1,Z1)","v":0.53125},{"$f":"1-(H14+J14)","v":4.166666666666663E-2},{"$f":"AVERAGE(Y3,Z3)","v":0.42708333333333337}]
["DEPLASMAN",{"$f":"'2'!Z11","v":9},{"$f":"'2'!AA11","v":5},{"$f":"'2'!AB11","v":0},{"$f":"'2'!AC11","v":4},{"$f":"'2'!AD11","v":367},{"$f":"'2'!AE11","v":374},{"$f":"IF('Betistuta MS'!O1<'0'!G5+'0'!G4,\"ÜST\",\"ALT\")","v":"ÜST"}]

{"sheet":"1","index":13,"n_rows":11,"n_cols":46,"rows_kept":11,"cut":false,"hidden":true,"merged":[[0,1,0,2]]}
[null,{"$f":"IF(D2=D3,D2,IF(D2=E3,D2,E2))","v":"Virtus Bolog"},null,"EV","DEP","EV","DEP","EV - DEP","SONUÇ","SKOR","SKOR","SIRA","W","D","L","EV","DEP","PUAN","OYUN","W","D","L","BERABERE","KAYBETMİŞ","BERABERE","OYUN","W","D","L","SKOR","SKOR","BERABERE",0,1,2,"3+",0,1,2,"3+","SKOR","SKOR","DEĞERLENDİRME","SERİ","TOPLAM","TOPLAM"]
[{"$f":"'Betistuta MS'!C48","v":"Virtus Bolog"},{"$f":"'Betistuta MS'!E48","v":"Olimpia Mila"},{"$f":"'Betistuta MS'!F48","v":"27-28"},{"$f":"A2","v":"Virtus Bolog"},"Olimpia Mila",{"$f":"VALUE(LEFT(C2,FIND(\"-\",C2,1)-1))","v":27},{"$f":"VALUE(LEFT(RIGHT(C2,LEN(C2)-FIND(\"-\",C2,1)),100))","v":28},{"$f":"IF(D2=$B$1,\"EV\",\"DEP\")","v":"EV"},{"$f":"IF(H2=\"EV\",IF(F2>G2,\"W\",IF(F2=G2,\"D\",\"L\")),IF(F2<G2,\"W\",IF(F2=G2,\"D\",\"L\")))","v":"L"},{"$f":"IF(H2=\"EV\",F2,G2)","v":27},{"$f":"IF(H2=\"EV\",G2,F2)","v":28},1,{"$f":"IF(I2=\"W\",1,0)","v":0},{"$f":"IF(I2=\"D\",1,0)","v":0},{"$f":"IF(I2=\"L\",1,0)","v":1},{"$f":"J2","v":27},{"$f":"K2","v":28},{"$f":"M2*3+N2","v":0},{"$f":"IF(H2=\"EV\",1,0)","v":1},{"$f":"IF(H2=\"EV\",IF(I2=\"W\",1,0),0)","v":0},{"$f":"IF(H2=\"EV\",IF(I2=\"D\",1,0),0)","v":0},{"$f":"IF(H2=\"EV\",IF(I2=\"L\",1,0),0)","v":1},{"$f":"IF(H2=\"EV\",J2,0)","v":27},{"$f":"IF(H2=\"EV\",K2,0)","v":28},{"$f":"T2*3+U2","v":0},{"$f":"IF(H2<>\"EV\",1,0)","v":0},{"$f":"IF(H2<>\"EV\",IF(I2=\"W\",1,0),0)","v":0},{"$f":"IF(H2<>\"EV\",IF(I2=\"D\",1,0),0)","v":0},{"$f":"IF(H2<>\"EV\",IF(I2=\"L\",1,0),0)","v":0},{"$f":"IF(H2<>\"EV\",J2,0)","v":0},{"$f":"IF(H2<>\"EV\",K2,0)","v":0},{"$f":"AA2*3+AB2","v":0},{"$f":"IF(H2=\"EV\",IF(J2=0,1,0),0)","v":0},{"$f":"IF(H2=\"EV\",IF(J2=1,1,0),0)","v":0},{"$f":"IF(H2=\"EV\",IF(J2=2,1,0),0)","v":0},{"$f":"IF(H2=\"EV\",IF(J2>=3,1,0),0)","v":1},{"$f":"IF(H2<>\"EV\",IF(J2=0,1,0),0)","v":0},{"$f":"IF(H2<>\"EV\",IF(J2=1,1,0),0)","v":0},{"$f":"IF(H2<>\"EV\",IF(J2=2,1,0),0)","v":0},{"$f":"IF(H2<>\"EV\",IF(J2>=3,1,0),0)","v":0},{"$f":"P2/L2","v":27},{"$f":"Q2/L2","v":28},{"$f":"(Y2/IF(S2<1,1,S2)+AF2/IF(Z2<1,1,Z2)*1.5+W2/IF(S2<1,1,S2)+AD2/IF(Z2<1,1,Z2)*1.5-X2/IF(S2<1,1,S2)*1.5-AE2/IF(Z2<1,1,Z2))/15","v":-1},{"$f":"IF(H2=\"EV\",IF(I2=\"W\",\"W\",IF(I2=\"D\",\"D\",\"L\")),\"\")","v":"L"},{"$f":"IF(H2=\"EV\",J2+K2,\"\")","v":55},{"$f":"F2+G2","v":55}]
[{"$f":"'Betistuta MS'!C49","v":"Tortona"},{"$f":"'Betistuta MS'!E49","v":"Virtus Bolog"},{"$f":"'Betistuta MS'!F49","v":"33-47"},"Tortona","Virtus Bolog",{"$f":"VALUE(LEFT(C3,FIND(\"-\",C3,1)-1))","v":33},{"$f":"VALUE(LEFT(RIGHT(C3,LEN(C3)-FIND(\"-\",C3,1)),100))","v":47},"DEP","W",47,33,{"$f":"L2+1","v":2},{"$f":"IF(I3=\"W\",M2+1,M2+0)","v":1},{"$f":"IF(I3=\"D\",N2+1,N2+0)","v":0},{"$f":"IF(I3=\"L\",O2+1,O2+0)","v":1},{"$f":"J3+P2","v":74},{"$f":"K3+Q2","v":61},3,{"$f":"IF(H3=\"EV\",S2+1,S2+0)","v":1},{"$f":"IF(H3=\"EV\",IF(I3=\"W\",T2+1,T2+0),T2+0)","v":0},{"$f":"IF(H3=\"EV\",IF(I3=\"D\",U2+1,U2+0),U2+0)","v":0},{"$f":"IF(H3=\"EV\",IF(I3=\"L\",V2+1,V2+0),V2+0)","v":1},{"$f":"IF(H3=\"EV\",W2+J3,W2+0)","v":27},{"$f":"IF(H3=\"EV\",X2+K3,X2+0)","v":28},0,{"$f":"IF(H3<>\"EV\",Z2+1,Z2+0)","v":1},{"$f":"IF(H3<>\"EV\",IF(I3=\"W\",AA2+1,AA2+0),AA2+0)","v":1},{"$f":"IF(H3<>\"EV\",IF(I3=\"D\",AB2+1,AB2+0),AB2+0)","v":0},{"$f":"IF(H3<>\"EV\",IF(I3=\"L\",AC2+1,AC2+0),AC2+0)","v":0},{"$f":"IF(H3<>\"EV\",AD2+J3,AD2+0)","v":47},{"$f":"IF(H3<>\"EV\",AE2+K3,AE2+0)","v":33},3,{"$f":"IF(H3=\"EV\",IF(J3=0,AG2+1,AG2),AG2)","v":0},{"$f":"IF(H3=\"EV\",IF(J3=1,AH2+1,AH2),AH2)","v":0},{"$f":"IF(H3=\"EV\",IF(J3=2,AI2+1,AI2),AI2)","v":0},{"$f":"IF(H3=\"EV\",IF(J3>=3,AJ2+1,AJ2),AJ2)","v":1},{"$f":"IF(H3<>\"EV\",IF(J3=0,AK2+1,AK2),AK2)","v":0},{"$f":"IF(H3<>\"EV\",IF(J3=1,AL2+1,AL2),AL2)","v":0},{"$f":"IF(H3<>\"EV\",IF(J3=2,AM2+1,AM2),AM2)","v":0},{"$f":"IF(H3<>\"EV\",IF(J3>=3,AN2+1,AN2),AN2)","v":1},37,30.5,{"$f":"(Y3/IF(S3<1,1,S3)+AF3/IF(Z3<1,1,Z3)*1.5+W3/IF(S3<1,1,S3)+AD3/IF(Z3<1,1,Z3)*1.5-X3/IF(S3<1,1,S3)*1.5-AE3/IF(Z3<1,1,Z3))/15","v":1.8},"","",{"$f":"F3+G3","v":80}]
[{"$f":"'Betistuta MS'!C50","v":"Virtus Bolog"},{"$f":"'Betistuta MS'!E50","v":"Tortona"},{"$f":"'Betistuta MS'!F50","v":"41-35"},"Virtus Bolog","Tortona",41,35,"EV","W",41,35,{"$f":"L3+1","v":3},2,0,1,{"$f":"J4+P3","v":115},96,6,2,1,0,1,68,63,3,1,1,0,0,47,33,3,0,0,0,2,0,0,0,1,38.333333333333336,32,{"$f":"(Y4/IF(S4<1,1,S4)+AF4/IF(Z4<1,1,Z4)*1.5+W4/IF(S4<1,1,S4)+AD4/IF(Z4<1,1,Z4)*1.5-X4/IF(S4<1,1,S4)*1.5-AE4/IF(Z4<1,1,Z4))/15","v":2.0166666666666666},"W",76,76]
[{"$f":"'Betistuta MS'!C51","v":"Virtus Bolog"},{"$f":"'Betistuta MS'!E51","v":"Tortona"},{"$f":"'Betistuta MS'!F51","v":"35-38"},"Virtus Bolog","Tortona",35,38,"EV","L",35,38,4,2,0,2,150,134,6,3,1,0,2,103,101,3,1,1,0,0,47,33,3,0,0,0,3,0,0,0,1,37.5,33.5,1.7888888888888894,"L",73,73]
[{"$f":"'Betistuta MS'!C52","v":"Pesaro"},{"$f":"'Betistuta MS'!E52","v":"Virtus Bolog"},{"$f":"'Betistuta MS'!F52","v":"35-35"},"Pesaro","Virtus Bolog",35,35,"DEP","D",35,35,5,2,1,2,185,169,7,3,1,0,2,103,101,3,2,1,1,0,82,68,4,0,0,0,3,0,0,0,2,37,33.799999999999997,1.0222222222222228,"","",70]
[{"$f":"'Betistuta MS'!C53","v":"Virtus Bolog"},{"$f":"'Betistuta MS'!E53","v":"Pesaro"},{"$f":"'Betistuta MS'!F53","v":"31-25"},"Virtus Bolog","Pesaro",31,25,"EV","W",31,25,6,3,1,2,216,194,10,4,2,0,2,134,126,6,2,1,1,0,82,68,4,0,0,0,4,0,0,0,2,36,32.333333333333336,1.2166666666666666,"W",56,56]
[{"$f":"'Betistuta MS'!C54","v":"Virtus Bolog"},{"$f":"'Betistuta MS'!E54","v":"Pesaro"},{"$f":"'Betistuta MS'!F54","v":"45-36"},"Virtus Bolog","Pesaro",45,36,"EV","W",45,36,7,4,1,2,261,230,13,5,3,0,2,179,162,9,2,1,1,0,82,68,4,0,0,0,5,0,0,0,2,37.285714285714285,32.857142857142854,1.3,"W",81,81]
[{"$f":"'Betistuta MS'!C55","v":"Virtus Bolog"},{"$f":"'Betistuta MS'!E55","v":"Bursaspor"},{"$f":"'Betistuta MS'!F55","v":"41-31"},"Virtus Bolog","Bursaspor",41,31,"EV","W",41,31,8,5,1,2,302,261,16,6,4,0,2,220,193,12,2,1,1,0,82,68,4,0,0,0,6,0,0,0,2,37.75,32.625,1.3944444444444437,"W",72,72]
[{"$f":"'Betistuta MS'!C56","v":"Virtus Bolog"},{"$f":"'Betistuta MS'!E56","v":"Brescia"},{"$f":"'Betistuta MS'!F56","v":"42-24"},"Virtus Bolog","Brescia",42,24,"EV","W",42,24,9,6,1,2,344,285,19,7,5,0,2,262,217,15,2,1,1,0,82,68,4,0,0,0,7,0,0,0,2,38.222222222222221,31.666666666666668,1.5714285714285714,"W",66,66]
[{"$f":"'Betistuta MS'!C57","v":"Sassari"},{"$f":"'Betistuta MS'!E57","v":"Virtus Bolog"},{"$f":"'Betistuta MS'!F57","v":"47-35"},"Sassari","Virtus Bolog",47,35,"DEP","L",35,47,10,6,1,3,379,332,19,7,5,0,2,262,217,15,3,1,1,1,117,115,4,0,0,0,7,0,0,0,3,37.9,33.200000000000003,1.0158730158730156,"","",82]

{"sheet":"2","index":14,"n_rows":11,"n_cols":46,"rows_kept":11,"cut":false,"hidden":true,"merged":[[0,1,0,2]]}
[null,{"$f":"IF(D2=D3,D2,IF(D2=E3,D2,E2))","v":"Olimpia Mila"},null,"EV","DEP","EV","DEP","EV - DEP","SONUÇ","SKOR","SKOR","SIRA","W","D","L","EV","DEP","PUAN","OYUN","W","D","L","BERABERE","KAYBETMİŞ","BERABERE","OYUN","W","D","L","SKOR","SKOR","BERABERE",0,1,2,"3+",0,1,2,"3+","SKOR","SKOR","DEĞERLENDİRME","SERİ","TOPLAM","TOPLAM"]
[{"$f":"'Betistuta MS'!C67","v":"Virtus Bolog"},{"$f":"'Betistuta MS'!E67","v":"Olimpia Mila"},{"$f":"'Betistuta MS'!F67","v":"27-28"},{"$f":"A2","v":"Virtus Bolog"},"Olimpia Mila",{"$f":"VALUE(LEFT(C2,FIND(\"-\",C2,1)-1))","v":27},{"$f":"VALUE(LEFT(RIGHT(C2,LEN(C2)-FIND(\"-\",C2,1)),100))","v":28},{"$f":"IF(D2=$D$2,\"EV\",\"DEP\")","v":"EV"},{"$f":"IF(H2=\"EV\",IF(F2>G2,\"W\",IF(F2=G2,\"D\",\"L\")),IF(F2<G2,\"W\",IF(F2=G2,\"D\",\"L\")))","v":"L"},{"$f":"IF(H2=\"EV\",F2,G2)","v":27},{"$f":"IF(H2=\"EV\",G2,F2)","v":28},1,{"$f":"IF(I2=\"W\",1,0)","v":0},{"$f":"IF(I2=\"D\",1,0)","v":0},{"$f":"IF(I2=\"L\",1,0)","v":1},{"$f":"J2","v":27},{"$f":"K2","v":28},{"$f":"M2*3+N2","v":0},{"$f":"IF(H2=\"EV\",1,0)","v":1},{"$f":"IF(H2=\"EV\",IF(I2=\"W\",1,0),0)","v":0},{"$f":"IF(H2=\"EV\",IF(I2=\"D\",1,0),0)","v":0},{"$f":"IF(H2=\"EV\",IF(I2=\"L\",1,0),0)","v":1},{"$f":"IF(H2=\"EV\",J2,0)","v":27},{"$f":"IF(H2=\"EV\",K2,0)","v":28},{"$f":"T2*3+U2","v":0},{"$f":"IF(H2<>\"EV\",1,0)","v":0},{"$f":"IF(H2<>\"EV\",IF(I2=\"W\",1,0),0)","v":0},{"$f":"IF(H2<>\"EV\",IF(I2=\"D\",1,0),0)","v":0},{"$f":"IF(H2<>\"EV\",IF(I2=\"L\",1,0),0)","v":0},{"$f":"IF(H2<>\"EV\",J2,0)","v":0},{"$f":"IF(H2<>\"EV\",K2,0)","v":0},{"$f":"AA2*3+AB2","v":0},{"$f":"IF(H2=\"EV\",IF(J2=0,1,0),0)","v":0},{"$f":"IF(H2=\"EV\",IF(J2=1,1,0),0)","v":0},{"$f":"IF(H2=\"EV\",IF(J2=2,1,0),0)","v":0},{"$f":"IF(H2=\"EV\",IF(J2>=3,1,0),0)","v":1},{"$f":"IF(H2<>\"EV\",IF(J2=0,1,0),0)","v":0},{"$f":"IF(H2<>\"EV\",IF(J2=1,1,0),0)","v":0},{"$f":"IF(H2<>\"EV\",IF(J2=2,1,0),0)","v":0},{"$f":"IF(H2<>\"EV\",IF(J2>=3,1,0),0)","v":0},{"$f":"P2/L2","v":27},{"$f":"Q2/L2","v":28},{"$f":"(Y2/IF(S2<1,1,S2)+AF2/IF(Z2<1,1,Z2)*1.5+W2/IF(S2<1,1,S2)+AD2/IF(Z2<1,1,Z2)*1.5-X2/IF(S2<1,1,S2)*1.5-AE2/IF(Z2<1,1,Z2))/15","v":-1},{"$f":"+IF(H2=\"DEP\",IF(I2=\"W\",\"W\",IF(I2=\"D\",\"D\",\"L\")),\"\")","v":""},{"$f":"IF(H2<>\"EV\",J2+K2,\"\")","v":""},{"$f":"F2+G2","v":55}]
[{"$f":"'Betistuta MS'!C68","v":"Sassari"},{"$f":"'Betistuta MS'!E68","v":"Olimpia Mila"},{"$f":"'Betistuta MS'!F68","v":"34-47"},"Sassari","Olimpia Mila",{"$f":"VALUE(LEFT(C3,FIND(\"-\",C3,1)-1))","v":34},{"$f":"VALUE(LEFT(RIGHT(C3,LEN(C3)-FIND(\"-\",C3,1)),100))","v":47},"DEP","W",47,34,{"$f":"L2+1","v":2},{"$f":"IF(I3=\"W\",M2+1,M2+0)","v":1},{"$f":"IF(I3=\"D\",N2+1,N2+0)","v":0},{"$f":"IF(I3=\"L\",O2+1,O2+0)","v":1},{"$f":"J3+P2","v":74},62,3,{"$f":"IF(H3=\"EV\",S2+1,S2+0)","v":1},{"$f":"IF(H3=\"EV\",IF(I3=\"W\",T2+1,T2+0),T2+0)","v":0},{"$f":"IF(H3=\"EV\",IF(I3=\"D\",U2+1,U2+0),U2+0)","v":0},{"$f":"IF(H3=\"EV\",IF(I3=\"L\",V2+1,V2+0),V2+0)","v":1},{"$f":"IF(H3=\"EV\",W2+J3,W2+0)","v":27},{"$f":"IF(H3=\"EV\",X2+K3,X2+0)","v":28},0,{"$f":"IF(H3<>\"EV\",Z2+1,Z2+0)","v":1},{"$f":"IF(H3<>\"EV\",IF(I3=\"W\",AA2+1,AA2+0),AA2+0)","v":1},{"$f":"IF(H3<>\"EV\",IF(I3=\"D\",AB2+1,AB2+0),AB2+0)","v":0},{"$f":"IF(H3<>\"EV\",IF(I3=\"L\",AC2+1,AC2+0),AC2+0)","v":0},{"$f":"IF(H3<>\"EV\",AD2+J3,AD2+0)","v":47},{"$f":"IF(H3<>\"EV\",AE2+K3,AE2+0)","v":34},3,{"$f":"IF(H3=\"EV\",IF(J3=0,AG2+1,AG2),AG2)","v":0},{"$f":"IF(H3=\"EV\",IF(J3=1,AH2+1,AH2),AH2)","v":0},{"$f":"IF(H3=\"EV\",IF(J3=2,AI2+1,AI2),AI2)","v":0},{"$f":"IF(H3=\"EV\",IF(J3>=3,AJ2+1,AJ2),AJ2)","v":1},{"$f":"IF(H3<>\"EV\",IF(J3=0,AK2+1,AK2),AK2)","v":0},{"$f":"IF(H3<>\"EV\",IF(J3=1,AL2+1,AL2),AL2)","v":0},{"$f":"IF(H3<>\"EV\",IF(J3=2,AM2+1,AM2),AM2)","v":0},{"$f":"IF(H3<>\"EV\",IF(J3>=3,AN2+1,AN2),AN2)","v":1},37,{"$f":"Q3/L3","v":31},{"$f":"(Y3/IF(S3<1,1,S3)+AF3/IF(Z3<1,1,Z3)*1.5+W3/IF(S3<1,1,S3)+AD3/IF(Z3<1,1,Z3)*1.5-X3/IF(S3<1,1,S3)*1.5-AE3/IF(Z3<1,1,Z3))/15","v":1.7333333333333334},{"$f":"+IF(H3=\"DEP\",IF(I3=\"W\",\"W\",IF(I3=\"D\",\"D\",\"L\")),\"\")","v":"W"},81,{"$f":"F3+G3","v":81}]
[{"$f":"'Betistuta MS'!C69","v":"Olimpia Mila"},{"$f":"'Betistuta MS'!E69","v":"Sassari"},{"$f":"'Betistuta MS'!F69","v":"41-49"},"Olimpia Mila","Sassari",41,49,"DEP","W",49,41,3,2,0,1,123,103,6,1,0,0,1,27,28,0,2,2,0,0,96,75,6,0,0,0,1,0,0,0,2,41,34.333333333333336,1.6,"W",90,90]
[{"$f":"'Betistuta MS'!C70","v":"Olimpia Mila"},{"$f":"'Betistuta MS'!E70","v":"Sassari"},{"$f":"'Betistuta MS'!F70","v":"50-42"},"Olimpia Mila","Sassari",50,42,"DEP","L",42,50,4,2,0,2,165,153,6,1,0,0,1,27,28,0,3,2,0,1,138,125,6,0,0,0,1,0,0,0,3,41.25,38.25,1.0222222222222224,"L",92,92]
[{"$f":"'Betistuta MS'!C71","v":"Reggiana"},{"$f":"'Betistuta MS'!E71","v":"Olimpia Mila"},{"$f":"'Betistuta MS'!F71","v":"27-43"},"Reggiana","Olimpia Mila",27,43,"DEP","W",43,27,5,3,0,2,208,180,9,1,0,0,1,27,28,0,4,3,0,1,181,152,9,0,0,0,1,0,0,0,4,41.6,36,1.2166666666666666,"W",70,70]
[{"$f":"'Betistuta MS'!C72","v":"Olimpia Mila"},{"$f":"'Betistuta MS'!E72","v":"Reggiana"},{"$f":"'Betistuta MS'!F72","v":"57-32"},"Olimpia Mila","Reggiana",57,32,"DEP","L",32,57,6,3,0,3,240,237,9,1,0,0,1,27,28,0,5,3,0,2,213,209,9,0,0,0,1,0,0,0,5,40,39.5,0.6533333333333341,"L",89,89]
[{"$f":"'Betistuta MS'!C73","v":"Olimpia Mila"},{"$f":"'Betistuta MS'!E73","v":"Reggiana"},{"$f":"'Betistuta MS'!F73","v":"51-40"},"Olimpia Mila","Reggiana",51,40,"DEP","L",40,51,7,3,0,4,280,288,9,1,0,0,1,27,28,0,6,3,0,3,253,260,9,0,0,0,1,0,0,0,6,40,41.142857142857146,0.47777777777777763,"L",91,91]
[{"$f":"'Betistuta MS'!C74","v":"Venezia"},{"$f":"'Betistuta MS'!E74","v":"Olimpia Mila"},{"$f":"'Betistuta MS'!F74","v":"41-32"},"Venezia","Olimpia Mila",41,32,"DEP","L",32,41,8,3,0,5,312,329,9,1,0,0,1,27,28,0,7,3,0,4,285,301,9,0,0,0,1,0,0,0,7,39,41.125,0.33333333333333331,"L",73,73]
[{"$f":"'Betistuta MS'!C75","v":"Treviso"},{"$f":"'Betistuta MS'!E75","v":"Olimpia Mila"},{"$f":"'Betistuta MS'!F75","v":"29-32"},"Treviso","Olimpia Mila",29,32,"DEP","W",32,29,9,4,0,5,344,358,12,1,0,0,1,27,28,0,8,4,0,4,317,330,12,0,0,0,1,0,0,0,8,38.222222222222221,39.777777777777779,0.36249999999999999,"W",61,61]
[{"$f":"'Betistuta MS'!C76","v":"Olimpia Mila"},{"$f":"'Betistuta MS'!E76","v":"Brindisi"},{"$f":"'Betistuta MS'!F76","v":"44-50"},"Olimpia Mila","Brindisi",44,50,"DEP","W",50,44,10,5,0,5,394,402,15,1,0,0,1,27,28,0,9,5,0,4,367,374,15,0,0,0,1,0,0,0,9,39.4,40.200000000000003,0.47407407407407426,"W",94,94]